null
SMILES: Cn1c2cc(CCCCN3CCCC3)c(O)cc2c2c3C(=O)NC(=O)c3c(cc12)-c1ccccc1Cl
InChI Key: InChIKey=WCRUEPKTOWQCQO-UHFFFAOYSA-N
Activity Spreadsheet -- Enzyme Inhibition Constant Data from BindingDB
Found 2 hits for monomerid = 50374070
Trg + Lig
Ki
nM
ΔG°
kcal/mole
IC50
nM
Kd
nM
EC50/IC50
nM
koff
s-1
kon
M-1s-1
pHTemp
°C
Wee1-like protein kinase
(Homo sapiens (Human))
BDBM50374070
(CHEMBL271084)
Show SMILES Cn1c2cc(CCCCN3CCCC3)c(O)cc2c2c3C(=O)NC(=O)c3c(cc12)-c1ccccc1Cl
Show InChI InChI=1S/C29H28ClN3O3/c1-32-22-14-17(8-4-5-11-33-12-6-7-13-33)24(34)16-20(22)25-23(32)15-19(18-9-2-3-10-21(18)30)26-27(25)29(36)31-28(26)35/h2-3,9-10,14-16,34H,4-8,11-13H2,1H3,(H,31,35,36)
NCI pathway
Reactome pathway
n/an/a 36n/an/an/an/an/an/a
University of Auckland
Curated by ChEMBL
Assay Description
Inhibition of human Wee1
Bioorg Med Chem Lett 18: 929-33 (2008)
Article DOI: 10.1016/j.bmcl.2007.12.046
BindingDB Entry DOI: 10.7270/Q2ZS2XC3
Serine/threonine-protein kinase Chk1
(Homo sapiens (Human))
BDBM50374070
(CHEMBL271084)
Show SMILES Cn1c2cc(CCCCN3CCCC3)c(O)cc2c2c3C(=O)NC(=O)c3c(cc12)-c1ccccc1Cl
Show InChI InChI=1S/C29H28ClN3O3/c1-32-22-14-17(8-4-5-11-33-12-6-7-13-33)24(34)16-20(22)25-23(32)15-19(18-9-2-3-10-21(18)30)26-27(25)29(36)31-28(26)35/h2-3,9-10,14-16,34H,4-8,11-13H2,1H3,(H,31,35,36)
Reactome pathway
n/an/a 4n/an/an/an/an/an/a
University of Auckland
Curated by ChEMBL
Assay Description
Inhibition of Chk1
Bioorg Med Chem Lett 18: 929-33 (2008)
Article DOI: 10.1016/j.bmcl.2007.12.046
BindingDB Entry DOI: 10.7270/Q2ZS2XC3