BDBM50374484 CHEMBL403412
SMILES: CCN(c1cccn(O)c1=O)S(=O)(=O)c1ccc(Oc2ccccc2)cc1
InChI Key: InChIKey=NZHYOLNTGNGMON-UHFFFAOYSA-N
Data: 2 IC50
Activity Spreadsheet -- Enzyme Inhibition Constant Data from BindingDB
Found 2 hits for monomerid = 50374484
Trg + Lig
Ki
nM
ΔG°
kcal/mole
IC50
nM
Kd
nM
EC50/IC50
nM
koff
s-1
kon
M-1s-1
pHTemp
°C
72 kDa type IV collagenase
(Homo sapiens (Human))
BDBM50374484
(CHEMBL403412)
Show SMILES CCN(c1cccn(O)c1=O)S(=O)(=O)c1ccc(Oc2ccccc2)cc1
Show InChI InChI=1S/C19H18N2O5S/c1-2-21(18-9-6-14-20(23)19(18)22)27(24,25)17-12-10-16(11-13-17)26-15-7-4-3-5-8-15/h3-14,23H,2H2,1H3
Reactome pathway
n/an/a 6.5n/an/an/an/an/an/a
Johnson& Johnson Pharmaceutical Research and Development
Curated by ChEMBL
Assay Description
Inhibition of MMP2
Bioorg Med Chem Lett 18: 409-13 (2008)
Article DOI: 10.1016/j.bmcl.2007.10.045
BindingDB Entry DOI: 10.7270/Q2833SWF
Matrix metalloproteinase-9
(Homo sapiens (Human))
BDBM50374484
(CHEMBL403412)
Show SMILES CCN(c1cccn(O)c1=O)S(=O)(=O)c1ccc(Oc2ccccc2)cc1
Show InChI InChI=1S/C19H18N2O5S/c1-2-21(18-9-6-14-20(23)19(18)22)27(24,25)17-12-10-16(11-13-17)26-15-7-4-3-5-8-15/h3-14,23H,2H2,1H3
Reactome pathway
n/an/a 3.60n/an/an/an/an/an/a
Johnson& Johnson Pharmaceutical Research and Development
Curated by ChEMBL
Assay Description
Inhibition of MMP9
Bioorg Med Chem Lett 18: 409-13 (2008)
Article DOI: 10.1016/j.bmcl.2007.10.045
BindingDB Entry DOI: 10.7270/Q2833SWF