BDBM50374555 REGRELOR DISODIUM
SMILES: CCNC(=O)Nc1ncnc2n(cnc12)[C@@H]1O[C@H](COP([O-])([O-])=O)[C@H]2O[C@@H](O[C@@H]12)\C=C\c1ccccc1
InChI Key: InChIKey=NXHAXEBZOXCDKD-XIXRRVGJSA-L
Data: 1 IC50
Activity Spreadsheet -- Enzyme Inhibition Constant Data from BindingDB
Found 1 hit for monomerid = 50374555
Trg + Lig
Ki
nM
ΔG°
kcal/mole
IC50
nM
Kd
nM
EC50/IC50
nM
koff
s-1
kon
M-1s-1
pHTemp
°C
Purinergic receptor P2Y12
(Homo sapiens (Human))
BDBM50374555
(REGRELOR DISODIUM)
Show SMILES CCNC(=O)Nc1ncnc2n(cnc12)[C@@H]1O[C@H](COP([O-])([O-])=O)[C@H]2O[C@@H](O[C@@H]12)\C=C\c1ccccc1
Show InChI InChI=1S/C22H25N6O8P/c1-2-23-22(29)27-19-16-20(25-11-24-19)28(12-26-16)21-18-17(14(34-21)10-33-37(30,31)32)35-15(36-18)9-8-13-6-4-3-5-7-13/h3-9,11-12,14-15,17-18,21H,2,10H2,1H3,(H2,30,31,32)(H2,23,24,25,27,29)/p-2/b9-8+/t14-,15+,17-,18-,21-/m1/s1
Reactome pathway
n/an/a 16n/an/an/an/an/an/a
Inspire Pharmaceuticals, Inc.
Curated by ChEMBL
Assay Description
Antagonist activity at P2Y12 receptor assessed as platelet aggregation by washed platelet assay
Bioorg Med Chem Lett 18: 2167-71 (2008)
Article DOI: 10.1016/j.bmcl.2008.01.038
BindingDB Entry DOI: 10.7270/Q2GM885R