BDBM50374605 CHEMBL273084::US9604926, Compound SN-99::US9724435, Compound SN-98
SMILES: O=c1sc2ccccc2n1CCCN1CCN(CC1)C1CCCCC1
InChI Key: InChIKey=KUIPFHRLGGNMLR-UHFFFAOYSA-N
Data: 13 KI
Activity Spreadsheet -- Enzyme Inhibition Constant Data from BindingDB
Found 13 hits for monomerid = 50374605
Trg + Lig
Ki
nM
ΔG°
kcal/mole
IC50
nM
Kd
nM
EC50/IC50
nM
koff
s-1
kon
M-1s-1
pHTemp
°C
Sigma intracellular receptor 2
(Mus musculus (Mouse))
BDBM50374605
(CHEMBL273084 | US9604926, Compound SN-99 | US97244...)
Show SMILES O=c1sc2ccccc2n1CCCN1CCN(CC1)C1CCCCC1
Show InChI InChI=1S/C20H29N3OS/c24-20-23(18-9-4-5-10-19(18)25-20)12-6-11-21-13-15-22(16-14-21)17-7-2-1-3-8-17/h4-5,9-10,17H,1-3,6-8,11-16H2
US Patent
2.44n/an/an/an/an/an/an/an/a
THE UNIVERSITY OF MISSISSIPPI
US Patent
Assay Description
Compounds were evaluated for σ-1 and σ-2 binding in rat brain homogenates. Twelve concentrations of each test ligand (0.001-1,000 nM) were ...
US Patent US9604926 (2017)
BindingDB Entry DOI: 10.7270/Q27D2X6J
Sigma intracellular receptor 2
(Mus musculus (Mouse))
BDBM50374605
(CHEMBL273084 | US9604926, Compound SN-99 | US97244...)
Show SMILES O=c1sc2ccccc2n1CCCN1CCN(CC1)C1CCCCC1
Show InChI InChI=1S/C20H29N3OS/c24-20-23(18-9-4-5-10-19(18)25-20)12-6-11-21-13-15-22(16-14-21)17-7-2-1-3-8-17/h4-5,9-10,17H,1-3,6-8,11-16H2
US Patent
2.44n/an/an/an/an/an/an/an/a
THE UNIVERSITY OF MISSISSIPPI
US Patent
Assay Description
Compounds were evaluated for σ-1 and σ-2 binding in rat brain homogenates. Twelve concentrations of each test ligand (0.001-1,000 nM) were ...
US Patent US9604926 (2017)
BindingDB Entry DOI: 10.7270/Q27D2X6J
Sigma intracellular receptor 2
(Mus musculus (Mouse))
BDBM50374605
(CHEMBL273084 | US9604926, Compound SN-99 | US97244...)
Show SMILES O=c1sc2ccccc2n1CCCN1CCN(CC1)C1CCCCC1
Show InChI InChI=1S/C20H29N3OS/c24-20-23(18-9-4-5-10-19(18)25-20)12-6-11-21-13-15-22(16-14-21)17-7-2-1-3-8-17/h4-5,9-10,17H,1-3,6-8,11-16H2
US Patent
3.05n/an/an/an/an/an/an/an/a
THE UNIVERSITY OF MISSISSIPPI
US Patent
Assay Description
Compounds were evaluated for σ-1 and σ-2 binding in rat brain homogenates. Twelve concentrations of each test ligand (0.001-1,000 nM) were ...
US Patent US9604926 (2017)
BindingDB Entry DOI: 10.7270/Q27D2X6J
Sigma intracellular receptor 2
(Mus musculus (Mouse))
BDBM50374605
(CHEMBL273084 | US9604926, Compound SN-99 | US97244...)
Show SMILES O=c1sc2ccccc2n1CCCN1CCN(CC1)C1CCCCC1
Show InChI InChI=1S/C20H29N3OS/c24-20-23(18-9-4-5-10-19(18)25-20)12-6-11-21-13-15-22(16-14-21)17-7-2-1-3-8-17/h4-5,9-10,17H,1-3,6-8,11-16H2
US Patent
3.05n/an/an/an/an/an/an/an/a
THE UNIVERSITY OF MISSISSIPPI
US Patent
Assay Description
Compounds were evaluated for σ-1 and σ-2 binding in rat brain homogenates. Twelve concentrations of each test ligand (0.001-1,000 nM) were ...
US Patent US9604926 (2017)
BindingDB Entry DOI: 10.7270/Q27D2X6J
Sigma-2 receptor
(Rattus norvegicus (Rat))
BDBM50374605
(CHEMBL273084 | US9604926, Compound SN-99 | US97244...)
Show SMILES O=c1sc2ccccc2n1CCCN1CCN(CC1)C1CCCCC1
Show InChI InChI=1S/C20H29N3OS/c24-20-23(18-9-4-5-10-19(18)25-20)12-6-11-21-13-15-22(16-14-21)17-7-2-1-3-8-17/h4-5,9-10,17H,1-3,6-8,11-16H2
US Patent
3.05n/an/an/an/an/an/an/an/a
THE UNIVERSITY OF MISSISSIPPI; THE BOARD OF TRUSTEES OF THE LELAND STANFORD JUNIOR UNIVERSITY
US Patent
Assay Description
Compounds were evaluated for σ-1 and σ-2 binding in rat brain homogenates. Twelve concentrations of each test ligand (0.001-1,000 nM) were ...
US Patent US9724435 (2017)
BindingDB Entry DOI: 10.7270/Q2BZ6856
Sigma-2 receptor
(Rattus norvegicus (Rat))
BDBM50374605
(CHEMBL273084 | US9604926, Compound SN-99 | US97244...)
Show SMILES O=c1sc2ccccc2n1CCCN1CCN(CC1)C1CCCCC1
Show InChI InChI=1S/C20H29N3OS/c24-20-23(18-9-4-5-10-19(18)25-20)12-6-11-21-13-15-22(16-14-21)17-7-2-1-3-8-17/h4-5,9-10,17H,1-3,6-8,11-16H2
US Patent
3.05n/an/an/an/an/an/an/an/a
THE UNIVERSITY OF MISSISSIPPI; THE BOARD OF TRUSTEES OF THE LELAND STANFORD JUNIOR UNIVERSITY
US Patent
Assay Description
Compounds were evaluated for σ-1 and σ-2 binding in rat brain homogenates. Twelve concentrations of each test ligand (0.001-1,000 nM) were ...
US Patent US9724435 (2017)
BindingDB Entry DOI: 10.7270/Q2BZ6856
Sigma non-opioid intracellular receptor 1
(Mus musculus (Mouse))
BDBM50374605
(CHEMBL273084 | US9604926, Compound SN-99 | US97244...)
Show SMILES O=c1sc2ccccc2n1CCCN1CCN(CC1)C1CCCCC1
Show InChI InChI=1S/C20H29N3OS/c24-20-23(18-9-4-5-10-19(18)25-20)12-6-11-21-13-15-22(16-14-21)17-7-2-1-3-8-17/h4-5,9-10,17H,1-3,6-8,11-16H2
US Patent
4.98n/an/an/an/an/an/an/an/a
THE UNIVERSITY OF MISSISSIPPI
US Patent
Assay Description
Compounds were evaluated for σ-1 and σ-2 binding in rat brain homogenates. Twelve concentrations of each test ligand (0.001-1,000 nM) were ...
US Patent US9604926 (2017)
BindingDB Entry DOI: 10.7270/Q27D2X6J
Sigma non-opioid intracellular receptor 1
(Mus musculus (Mouse))
BDBM50374605
(CHEMBL273084 | US9604926, Compound SN-99 | US97244...)
Show SMILES O=c1sc2ccccc2n1CCCN1CCN(CC1)C1CCCCC1
Show InChI InChI=1S/C20H29N3OS/c24-20-23(18-9-4-5-10-19(18)25-20)12-6-11-21-13-15-22(16-14-21)17-7-2-1-3-8-17/h4-5,9-10,17H,1-3,6-8,11-16H2
US Patent
4.98n/an/an/an/an/an/an/an/a
THE UNIVERSITY OF MISSISSIPPI
US Patent
Assay Description
Compounds were evaluated for σ-1 and σ-2 binding in rat brain homogenates. Twelve concentrations of each test ligand (0.001-1,000 nM) were ...
US Patent US9604926 (2017)
BindingDB Entry DOI: 10.7270/Q27D2X6J
Sigma non-opioid intracellular receptor 1
(RAT)
BDBM50374605
(CHEMBL273084 | US9604926, Compound SN-99 | US97244...)
Show SMILES O=c1sc2ccccc2n1CCCN1CCN(CC1)C1CCCCC1
Show InChI InChI=1S/C20H29N3OS/c24-20-23(18-9-4-5-10-19(18)25-20)12-6-11-21-13-15-22(16-14-21)17-7-2-1-3-8-17/h4-5,9-10,17H,1-3,6-8,11-16H2
US Patent
5.61n/an/an/an/an/an/an/an/a
THE UNIVERSITY OF MISSISSIPPI; THE BOARD OF TRUSTEES OF THE LELAND STANFORD JUNIOR UNIVERSITY
US Patent
Assay Description
Compounds were evaluated for σ-1 and σ-2 binding in rat brain homogenates. Twelve concentrations of each test ligand (0.001-1,000 nM) were ...
US Patent US9724435 (2017)
BindingDB Entry DOI: 10.7270/Q2BZ6856
Sigma non-opioid intracellular receptor 1
(RAT)
BDBM50374605
(CHEMBL273084 | US9604926, Compound SN-99 | US97244...)
Show SMILES O=c1sc2ccccc2n1CCCN1CCN(CC1)C1CCCCC1
Show InChI InChI=1S/C20H29N3OS/c24-20-23(18-9-4-5-10-19(18)25-20)12-6-11-21-13-15-22(16-14-21)17-7-2-1-3-8-17/h4-5,9-10,17H,1-3,6-8,11-16H2
US Patent
5.61n/an/an/an/an/an/an/an/a
THE UNIVERSITY OF MISSISSIPPI; THE BOARD OF TRUSTEES OF THE LELAND STANFORD JUNIOR UNIVERSITY
US Patent
Assay Description
Compounds were evaluated for σ-1 and σ-2 binding in rat brain homogenates. Twelve concentrations of each test ligand (0.001-1,000 nM) were ...
US Patent US9724435 (2017)
BindingDB Entry DOI: 10.7270/Q2BZ6856
Sigma non-opioid intracellular receptor 1
(RAT)
BDBM50374605
(CHEMBL273084 | US9604926, Compound SN-99 | US97244...)
Show SMILES O=c1sc2ccccc2n1CCCN1CCN(CC1)C1CCCCC1
Show InChI InChI=1S/C20H29N3OS/c24-20-23(18-9-4-5-10-19(18)25-20)12-6-11-21-13-15-22(16-14-21)17-7-2-1-3-8-17/h4-5,9-10,17H,1-3,6-8,11-16H2
5.61n/an/an/an/an/an/an/an/a
The University of Mississippi
Curated by PDSP Ki Database
Assay Description
Displacement of [3H](+)-pentazocine from opioid sigma1 receptor in rat brain homogenate
J Med Chem 51: 1482-6 (2008)
Article DOI: 10.1021/jm701357m
BindingDB Entry DOI: 10.7270/Q2736RTZ
Sigma non-opioid intracellular receptor 1
(Mus musculus (Mouse))
BDBM50374605
(CHEMBL273084 | US9604926, Compound SN-99 | US97244...)
Show SMILES O=c1sc2ccccc2n1CCCN1CCN(CC1)C1CCCCC1
Show InChI InChI=1S/C20H29N3OS/c24-20-23(18-9-4-5-10-19(18)25-20)12-6-11-21-13-15-22(16-14-21)17-7-2-1-3-8-17/h4-5,9-10,17H,1-3,6-8,11-16H2
US Patent
5.61n/an/an/an/an/an/an/an/a
THE UNIVERSITY OF MISSISSIPPI
US Patent
Assay Description
Compounds were evaluated for σ-1 and σ-2 binding in rat brain homogenates. Twelve concentrations of each test ligand (0.001-1,000 nM) were ...
US Patent US9604926 (2017)
BindingDB Entry DOI: 10.7270/Q27D2X6J
Sigma non-opioid intracellular receptor 1
(Mus musculus (Mouse))
BDBM50374605
(CHEMBL273084 | US9604926, Compound SN-99 | US97244...)
Show SMILES O=c1sc2ccccc2n1CCCN1CCN(CC1)C1CCCCC1
Show InChI InChI=1S/C20H29N3OS/c24-20-23(18-9-4-5-10-19(18)25-20)12-6-11-21-13-15-22(16-14-21)17-7-2-1-3-8-17/h4-5,9-10,17H,1-3,6-8,11-16H2
US Patent
5.61n/an/an/an/an/an/an/an/a
THE UNIVERSITY OF MISSISSIPPI
US Patent
Assay Description
Compounds were evaluated for σ-1 and σ-2 binding in rat brain homogenates. Twelve concentrations of each test ligand (0.001-1,000 nM) were ...
US Patent US9604926 (2017)
BindingDB Entry DOI: 10.7270/Q27D2X6J