BDBM50374625 CHEMBL403522
SMILES: COc1cc(Nc2ncc3c(n2)n2c4ccccc4nc2n(-c2c(C)cccc2C)c3=O)ccc1N1CCN(C)CC1
InChI Key: InChIKey=WZMNAAQWSDHSHF-UHFFFAOYSA-N
Data: 4 IC50
Activity Spreadsheet -- Enzyme Inhibition Constant Data from BindingDB
Found 4 hits for monomerid = 50374625
Trg + Lig
Ki
nM
ΔG°
kcal/mole
IC50
nM
Kd
nM
EC50/IC50
nM
koff
s-1
kon
M-1s-1
pHTemp
°C
Tyrosine-protein kinase Lck
(Homo sapiens (Human))
BDBM50374625
(CHEMBL403522)
Show SMILES COc1cc(Nc2ncc3c(n2)n2c4ccccc4nc2n(-c2c(C)cccc2C)c3=O)ccc1N1CCN(C)CC1 |(-2.95,-19.43,;-4.29,-20.2,;-4.29,-21.74,;-2.96,-22.51,;-2.97,-24.05,;-1.64,-24.82,;-.3,-24.05,;-.3,-22.51,;1.02,-21.74,;2.36,-22.5,;2.36,-24.05,;1.03,-24.83,;3.7,-24.82,;4.02,-26.32,;3.11,-27.55,;3.73,-28.96,;5.26,-29.13,;6.16,-27.89,;5.55,-26.49,;6.18,-25.09,;5.04,-24.05,;5.04,-22.5,;6.37,-21.74,;6.37,-20.2,;5.03,-19.44,;7.7,-19.43,;9.04,-20.2,;9.03,-21.75,;7.7,-22.51,;7.69,-24.05,;3.7,-21.73,;3.7,-20.19,;-4.29,-24.82,;-5.62,-24.05,;-5.63,-22.51,;-6.96,-21.74,;-6.95,-20.2,;-8.28,-19.43,;-9.62,-20.19,;-10.95,-19.42,;-9.62,-21.73,;-8.29,-22.51,)|
Show InChI InChI=1S/C32H32N8O2/c1-20-8-7-9-21(2)28(20)40-30(41)23-19-33-31(36-29(23)39-25-11-6-5-10-24(25)35-32(39)40)34-22-12-13-26(27(18-22)42-4)38-16-14-37(3)15-17-38/h5-13,18-19H,14-17H2,1-4H3,(H,33,34,36)
n/an/a 5n/an/an/an/an/an/a
Amgen Inc.
Curated by ChEMBL
Assay Description
Inhibition of Lck by HTRF assay
J Med Chem 51: 1637-48 (2008)
Article DOI: 10.1021/jm701095m
BindingDB Entry DOI: 10.7270/Q23B6114
Vascular endothelial growth factor receptor 2
(Homo sapiens (Human))
BDBM50374625
(CHEMBL403522)
Show SMILES COc1cc(Nc2ncc3c(n2)n2c4ccccc4nc2n(-c2c(C)cccc2C)c3=O)ccc1N1CCN(C)CC1 |(-2.95,-19.43,;-4.29,-20.2,;-4.29,-21.74,;-2.96,-22.51,;-2.97,-24.05,;-1.64,-24.82,;-.3,-24.05,;-.3,-22.51,;1.02,-21.74,;2.36,-22.5,;2.36,-24.05,;1.03,-24.83,;3.7,-24.82,;4.02,-26.32,;3.11,-27.55,;3.73,-28.96,;5.26,-29.13,;6.16,-27.89,;5.55,-26.49,;6.18,-25.09,;5.04,-24.05,;5.04,-22.5,;6.37,-21.74,;6.37,-20.2,;5.03,-19.44,;7.7,-19.43,;9.04,-20.2,;9.03,-21.75,;7.7,-22.51,;7.69,-24.05,;3.7,-21.73,;3.7,-20.19,;-4.29,-24.82,;-5.62,-24.05,;-5.63,-22.51,;-6.96,-21.74,;-6.95,-20.2,;-8.28,-19.43,;-9.62,-20.19,;-10.95,-19.42,;-9.62,-21.73,;-8.29,-22.51,)|
Show InChI InChI=1S/C32H32N8O2/c1-20-8-7-9-21(2)28(20)40-30(41)23-19-33-31(36-29(23)39-25-11-6-5-10-24(25)35-32(39)40)34-22-12-13-26(27(18-22)42-4)38-16-14-37(3)15-17-38/h5-13,18-19H,14-17H2,1-4H3,(H,33,34,36)
NCI pathway
Reactome pathway
n/an/a 3.60E+3n/an/an/an/an/an/a
Amgen Inc.
Curated by ChEMBL
Assay Description
Inhibition of KDR by HTRF assay
J Med Chem 51: 1637-48 (2008)
Article DOI: 10.1021/jm701095m
BindingDB Entry DOI: 10.7270/Q23B6114
Mitogen-activated protein kinase 14
(Homo sapiens (Human))
BDBM50374625
(CHEMBL403522)
Show SMILES COc1cc(Nc2ncc3c(n2)n2c4ccccc4nc2n(-c2c(C)cccc2C)c3=O)ccc1N1CCN(C)CC1 |(-2.95,-19.43,;-4.29,-20.2,;-4.29,-21.74,;-2.96,-22.51,;-2.97,-24.05,;-1.64,-24.82,;-.3,-24.05,;-.3,-22.51,;1.02,-21.74,;2.36,-22.5,;2.36,-24.05,;1.03,-24.83,;3.7,-24.82,;4.02,-26.32,;3.11,-27.55,;3.73,-28.96,;5.26,-29.13,;6.16,-27.89,;5.55,-26.49,;6.18,-25.09,;5.04,-24.05,;5.04,-22.5,;6.37,-21.74,;6.37,-20.2,;5.03,-19.44,;7.7,-19.43,;9.04,-20.2,;9.03,-21.75,;7.7,-22.51,;7.69,-24.05,;3.7,-21.73,;3.7,-20.19,;-4.29,-24.82,;-5.62,-24.05,;-5.63,-22.51,;-6.96,-21.74,;-6.95,-20.2,;-8.28,-19.43,;-9.62,-20.19,;-10.95,-19.42,;-9.62,-21.73,;-8.29,-22.51,)|
Show InChI InChI=1S/C32H32N8O2/c1-20-8-7-9-21(2)28(20)40-30(41)23-19-33-31(36-29(23)39-25-11-6-5-10-24(25)35-32(39)40)34-22-12-13-26(27(18-22)42-4)38-16-14-37(3)15-17-38/h5-13,18-19H,14-17H2,1-4H3,(H,33,34,36)
NCI pathway
Reactome pathway
n/an/a 7.50E+3n/an/an/an/an/an/a
Amgen Inc.
Curated by ChEMBL
Assay Description
Inhibition of p38-alpha by HTRF assay
J Med Chem 51: 1637-48 (2008)
Article DOI: 10.1021/jm701095m
BindingDB Entry DOI: 10.7270/Q23B6114
Proto-oncogene tyrosine-protein kinase Src
(Homo sapiens (Human))
BDBM50374625
(CHEMBL403522)
Show SMILES COc1cc(Nc2ncc3c(n2)n2c4ccccc4nc2n(-c2c(C)cccc2C)c3=O)ccc1N1CCN(C)CC1 |(-2.95,-19.43,;-4.29,-20.2,;-4.29,-21.74,;-2.96,-22.51,;-2.97,-24.05,;-1.64,-24.82,;-.3,-24.05,;-.3,-22.51,;1.02,-21.74,;2.36,-22.5,;2.36,-24.05,;1.03,-24.83,;3.7,-24.82,;4.02,-26.32,;3.11,-27.55,;3.73,-28.96,;5.26,-29.13,;6.16,-27.89,;5.55,-26.49,;6.18,-25.09,;5.04,-24.05,;5.04,-22.5,;6.37,-21.74,;6.37,-20.2,;5.03,-19.44,;7.7,-19.43,;9.04,-20.2,;9.03,-21.75,;7.7,-22.51,;7.69,-24.05,;3.7,-21.73,;3.7,-20.19,;-4.29,-24.82,;-5.62,-24.05,;-5.63,-22.51,;-6.96,-21.74,;-6.95,-20.2,;-8.28,-19.43,;-9.62,-20.19,;-10.95,-19.42,;-9.62,-21.73,;-8.29,-22.51,)|
Show InChI InChI=1S/C32H32N8O2/c1-20-8-7-9-21(2)28(20)40-30(41)23-19-33-31(36-29(23)39-25-11-6-5-10-24(25)35-32(39)40)34-22-12-13-26(27(18-22)42-4)38-16-14-37(3)15-17-38/h5-13,18-19H,14-17H2,1-4H3,(H,33,34,36)
n/an/a 100n/an/an/an/an/an/a
Amgen Inc.
Curated by ChEMBL
Assay Description
Inhibition of Src by HTRF assay
J Med Chem 51: 1637-48 (2008)
Article DOI: 10.1021/jm701095m
BindingDB Entry DOI: 10.7270/Q23B6114