BDBM50375153 CHEMBL272738
SMILES: CN1CCN(CC1)c1ccc(Nc2cc3n(cc(C(N)=O)c(=O)c3cn2)-c2ccc3CCCc3c2)cc1
InChI Key: InChIKey=RZASZBXSWIEAKW-UHFFFAOYSA-N
Data: 1 IC50
Activity Spreadsheet -- Enzyme Inhibition Constant Data from BindingDB
Found 1 hit for monomerid = 50375153
Trg + Lig
Ki
nM
ΔG°
kcal/mole
IC50
nM
Kd
nM
EC50/IC50
nM
koff
s-1
kon
M-1s-1
pHTemp
°C
Macrophage colony stimulating factor receptor
(Homo sapiens (Human))
BDBM50375153
(CHEMBL272738)
Show SMILES CN1CCN(CC1)c1ccc(Nc2cc3n(cc(C(N)=O)c(=O)c3cn2)-c2ccc3CCCc3c2)cc1
Show InChI InChI=1S/C29H30N6O2/c1-33-11-13-34(14-12-33)22-9-6-21(7-10-22)32-27-16-26-24(17-31-27)28(36)25(29(30)37)18-35(26)23-8-5-19-3-2-4-20(19)15-23/h5-10,15-18H,2-4,11-14H2,1H3,(H2,30,37)(H,31,32)
n/an/a 56n/an/an/an/an/an/a
Johnson& Johnson Pharmaceutical Research& Development
Curated by ChEMBL
Assay Description
Inhibition of ATP-induced CSF1R autophosphorylation
Bioorg Med Chem Lett 18: 2355-61 (2008)
Article DOI: 10.1016/j.bmcl.2008.02.070
BindingDB Entry DOI: 10.7270/Q26W9BX3