BDBM50375159 CHEMBL255794
SMILES: CC1CN(CC(C)N1)c1ccc(Nc2ncc3c(n2)n(cc(C(N)=O)c3=O)-c2ccc3CCCc3c2)cc1
InChI Key: InChIKey=AHBSXTVFKVCNCE-UHFFFAOYSA-N
Data: 1 IC50
Activity Spreadsheet -- Enzyme Inhibition Constant Data from BindingDB
Found 1 hit for monomerid = 50375159
Trg + Lig
Ki
nM
ΔG°
kcal/mole
IC50
nM
Kd
nM
EC50/IC50
nM
koff
s-1
kon
M-1s-1
pHTemp
°C
Macrophage colony stimulating factor receptor
(Homo sapiens (Human))
BDBM50375159
(CHEMBL255794)
Show SMILES CC1CN(CC(C)N1)c1ccc(Nc2ncc3c(n2)n(cc(C(N)=O)c3=O)-c2ccc3CCCc3c2)cc1 |w:1.0,5.5|
Show InChI InChI=1S/C29H31N7O2/c1-17-14-35(15-18(2)32-17)22-10-7-21(8-11-22)33-29-31-13-24-26(37)25(27(30)38)16-36(28(24)34-29)23-9-6-19-4-3-5-20(19)12-23/h6-13,16-18,32H,3-5,14-15H2,1-2H3,(H2,30,38)(H,31,33,34)
n/an/a 7n/an/an/an/an/an/a
Johnson& Johnson Pharmaceutical Research& Development
Curated by ChEMBL
Assay Description
Inhibition of ATP-induced CSF1R autophosphorylation
Bioorg Med Chem Lett 18: 2355-61 (2008)
Article DOI: 10.1016/j.bmcl.2008.02.070
BindingDB Entry DOI: 10.7270/Q26W9BX3