BDBM50375327 CHEMBL410874
SMILES: C[N+](C)(C)C[C@H](CC(O)=O)OC(=O)CCCCCCCCCCCCCCCO[N+]([O-])=O
InChI Key: InChIKey=RTDNCALXOFDBAO-NRFANRHFSA-O
Data: 1 IC50
Activity Spreadsheet -- Enzyme Inhibition Constant Data from BindingDB
Found 1 hit for monomerid = 50375327
Trg + Lig
Ki
nM
ΔG°
kcal/mole
IC50
nM
Kd
nM
EC50/IC50
nM
koff
s-1
kon
M-1s-1
pHTemp
°C
Solute carrier family 22 member 5
(Rattus norvegicus)
BDBM50375327
(CHEMBL410874)
Show SMILES C[N+](C)(C)C[C@H](CC(O)=O)OC(=O)CCCCCCCCCCCCCCCO[N+]([O-])=O
Show InChI InChI=1S/C23H44N2O7/c1-25(2,3)20-21(19-22(26)27)32-23(28)17-15-13-11-9-7-5-4-6-8-10-12-14-16-18-31-24(29)30/h21H,4-20H2,1-3H3/p+1/t21-/m0/s1
Reactome pathway
n/an/a 5.30E+4n/an/an/an/an/an/a
University of Perugia
Curated by ChEMBL
Assay Description
Inhibition of rat kidney brush border membrane OCTN2 transporter assessed as [3H]carnitine uptake after 10 mins
Bioorg Med Chem 16: 1444-51 (2008)
Article DOI: 10.1016/j.bmc.2007.10.053
BindingDB Entry DOI: 10.7270/Q21837CN