BDBM50375668 CHEMBL259526
SMILES: CC=NC#N
InChI Key: InChIKey=WLUKHWRYOREQIK-UHFFFAOYSA-N
Data: 2 IC50
Activity Spreadsheet -- Enzyme Inhibition Constant Data from BindingDB
Found 2 hits for monomerid = 50375668
Trg + Lig
Ki
nM
ΔG°
kcal/mole
IC50
nM
Kd
nM
EC50/IC50
nM
koff
s-1
kon
M-1s-1
pHTemp
°C
Dual specificity mitogen-activated protein kinase kinase 3
(Homo sapiens (Human))
BDBM50375668
(CHEMBL259526)
Show SMILES CC=NC#N |w:1.0|
Show InChI InChI=1S/C3H4N2/c1-2-5-3-4/h2H,1H3
Reactome pathway
n/an/a>1.00E+3n/an/an/an/an/an/a
University of Oxford
Curated by ChEMBL
Assay Description
Inhibition of MKK3
Proc Natl Acad Sci USA 104: 20523-8 (2007)
Checked by Author
Article DOI: 10.1073/pnas.0708800104
BindingDB Entry DOI: 10.7270/Q2DB82RH
Dual specificity mitogen-activated protein kinase kinase 4
(Homo sapiens (Human))
BDBM50375668
(CHEMBL259526)
Show SMILES CC=NC#N |w:1.0|
Show InChI InChI=1S/C3H4N2/c1-2-5-3-4/h2H,1H3
NCI pathway
Reactome pathway
n/an/a>1.00E+3n/an/an/an/an/an/a
University of Oxford
Curated by ChEMBL
Assay Description
Inhibition of MKK4
Proc Natl Acad Sci USA 104: 20523-8 (2007)
Checked by Author
Article DOI: 10.1073/pnas.0708800104
BindingDB Entry DOI: 10.7270/Q2DB82RH