BDBM50375729 CHEMBL257064
SMILES: Nc1ccc(cc1C(=O)NCC(=O)N[C@@H]1CCN(Cc2ccc(O)cc2)C1)C(F)(F)F
InChI Key: InChIKey=NTDUGNWTONHPJW-OAHLLOKOSA-N
Data: 2 IC50
Activity Spreadsheet -- Enzyme Inhibition Constant Data from BindingDB
Found 2 hits for monomerid = 50375729
Trg + Lig
Ki
nM
ΔG°
kcal/mole
IC50
nM
Kd
nM
EC50/IC50
nM
koff
s-1
kon
M-1s-1
pHTemp
°C
C-C chemokine receptor type 2
(Homo sapiens (Human))
BDBM50375729
(CHEMBL257064)
Show SMILES Nc1ccc(cc1C(=O)NCC(=O)N[C@@H]1CCN(Cc2ccc(O)cc2)C1)C(F)(F)F
Show InChI InChI=1S/C21H23F3N4O3/c22-21(23,24)14-3-6-18(25)17(9-14)20(31)26-10-19(30)27-15-7-8-28(12-15)11-13-1-4-16(29)5-2-13/h1-6,9,15,29H,7-8,10-12,25H2,(H,26,31)(H,27,30)/t15-/m1/s1
n/an/a 42n/an/an/an/an/an/a
Deltagen Research Laboratories (Former CombiChem, Inc.
Curated by ChEMBL
Assay Description
Displacement of [125I]MCP1 from human CCR2b in THP1 cells
Bioorg Med Chem Lett 18: 1869-73 (2008)
Article DOI: 10.1016/j.bmcl.2008.02.015
BindingDB Entry DOI: 10.7270/Q2W95B2Q
C-C chemokine receptor type 2
(Homo sapiens (Human))
BDBM50375729
(CHEMBL257064)
Show SMILES Nc1ccc(cc1C(=O)NCC(=O)N[C@@H]1CCN(Cc2ccc(O)cc2)C1)C(F)(F)F
Show InChI InChI=1S/C21H23F3N4O3/c22-21(23,24)14-3-6-18(25)17(9-14)20(31)26-10-19(30)27-15-7-8-28(12-15)11-13-1-4-16(29)5-2-13/h1-6,9,15,29H,7-8,10-12,25H2,(H,26,31)(H,27,30)/t15-/m1/s1
n/an/a 5.10n/an/an/an/an/an/a
Deltagen Research Laboratories (Former CombiChem, Inc.
Curated by ChEMBL
Assay Description
Antagonist activity at human CCR2 in THP1 cells assessed as inhibition of MCP1-induced chemotaxis
Bioorg Med Chem Lett 18: 1869-73 (2008)
Article DOI: 10.1016/j.bmcl.2008.02.015
BindingDB Entry DOI: 10.7270/Q2W95B2Q