BDBM50376045 CHEMBL273064
SMILES: Clc1ccc(NC(=O)c2cccc3cc(Oc4ccnc5ccccc45)ccc23)cc1
InChI Key: InChIKey=GWEYWJXZYOROAI-UHFFFAOYSA-N
Data: 2 IC50
Activity Spreadsheet -- Enzyme Inhibition Constant Data from BindingDB
Found 2 hits for monomerid = 50376045
Trg + Lig
Ki
nM
ΔG°
kcal/mole
IC50
nM
Kd
nM
EC50/IC50
nM
koff
s-1
kon
M-1s-1
pHTemp
°C
Vascular endothelial growth factor receptor 2
(Homo sapiens (Human))
BDBM50376045
(CHEMBL273064)
Show SMILES Clc1ccc(NC(=O)c2cccc3cc(Oc4ccnc5ccccc45)ccc23)cc1
Show InChI InChI=1S/C26H17ClN2O2/c27-18-8-10-19(11-9-18)29-26(30)22-6-3-4-17-16-20(12-13-21(17)22)31-25-14-15-28-24-7-2-1-5-23(24)25/h1-16H,(H,29,30)
NCI pathway
Reactome pathway
n/an/a 3.98n/an/an/an/an/an/a
Lanzhou University
Curated by ChEMBL
Assay Description
Inhibition of human VEGFR2 after 60 mins
J Mol Graph Model 27: 642-54 (2008)
Article DOI: 10.1016/j.jmgm.2008.10.006
BindingDB Entry DOI: 10.7270/Q2C24XNX
Vascular endothelial growth factor receptor 2
(Homo sapiens (Human))
BDBM50376045
(CHEMBL273064)
Show SMILES Clc1ccc(NC(=O)c2cccc3cc(Oc4ccnc5ccccc45)ccc23)cc1
Show InChI InChI=1S/C26H17ClN2O2/c27-18-8-10-19(11-9-18)29-26(30)22-6-3-4-17-16-20(12-13-21(17)22)31-25-14-15-28-24-7-2-1-5-23(24)25/h1-16H,(H,29,30)
NCI pathway
Reactome pathway
n/an/a 4n/an/an/an/an/an/a
Amgen Inc.
Curated by ChEMBL
Assay Description
Inhibition of KDR by HTRF assay
J Med Chem 51: 1649-67 (2008)
Article DOI: 10.1021/jm701097z
BindingDB Entry DOI: 10.7270/Q29C6Z8N