BDBM50376048 CHEMBL413933
SMILES: CNc1nccc(Oc2ccc3c(cccc3c2)C(=O)Nc2ccc(Cl)cc2)n1
InChI Key: InChIKey=UKFXPJQEYJBYQU-UHFFFAOYSA-N
Data: 2 IC50
Activity Spreadsheet -- Enzyme Inhibition Constant Data from BindingDB
Found 2 hits for monomerid = 50376048
Trg + Lig
Ki
nM
ΔG°
kcal/mole
IC50
nM
Kd
nM
EC50/IC50
nM
koff
s-1
kon
M-1s-1
pHTemp
°C
Vascular endothelial growth factor receptor 2
(Homo sapiens (Human))
BDBM50376048
(CHEMBL413933)
Show SMILES CNc1nccc(Oc2ccc3c(cccc3c2)C(=O)Nc2ccc(Cl)cc2)n1
Show InChI InChI=1S/C22H17ClN4O2/c1-24-22-25-12-11-20(27-22)29-17-9-10-18-14(13-17)3-2-4-19(18)21(28)26-16-7-5-15(23)6-8-16/h2-13H,1H3,(H,26,28)(H,24,25,27)
NCI pathway
Reactome pathway
n/an/a 45.7n/an/an/an/an/an/a
Lanzhou University
Curated by ChEMBL
Assay Description
Inhibition of human VEGFR2 after 60 mins
J Mol Graph Model 27: 642-54 (2008)
Article DOI: 10.1016/j.jmgm.2008.10.006
BindingDB Entry DOI: 10.7270/Q2C24XNX
Vascular endothelial growth factor receptor 2
(Homo sapiens (Human))
BDBM50376048
(CHEMBL413933)
Show SMILES CNc1nccc(Oc2ccc3c(cccc3c2)C(=O)Nc2ccc(Cl)cc2)n1
Show InChI InChI=1S/C22H17ClN4O2/c1-24-22-25-12-11-20(27-22)29-17-9-10-18-14(13-17)3-2-4-19(18)21(28)26-16-7-5-15(23)6-8-16/h2-13H,1H3,(H,26,28)(H,24,25,27)
NCI pathway
Reactome pathway
n/an/a 46n/an/an/an/an/an/a
Amgen Inc.
Curated by ChEMBL
Assay Description
Inhibition of KDR by HTRF assay
J Med Chem 51: 1649-67 (2008)
Article DOI: 10.1021/jm701097z
BindingDB Entry DOI: 10.7270/Q29C6Z8N