BDBM50376110 CHEMBL409350
SMILES: CCC(=O)c1c(-c2ccccc2)c2cc(Cl)ccc2c(=O)n1Cc1cc(C(=O)NC2CC2)n(CC(F)F)n1
InChI Key: InChIKey=JEJMFKYPHZDFNI-UHFFFAOYSA-N
Data: 2 IC50
Activity Spreadsheet -- Enzyme Inhibition Constant Data from BindingDB
Found 2 hits for monomerid = 50376110
Trg + Lig
Ki
nM
ΔG°
kcal/mole
IC50
nM
Kd
nM
EC50/IC50
nM
koff
s-1
kon
M-1s-1
pHTemp
°C
Mitogen-activated protein kinase 8
(Rattus norvegicus)
BDBM50376110
(CHEMBL409350)
Show SMILES CCC(=O)c1c(-c2ccccc2)c2cc(Cl)ccc2c(=O)n1Cc1cc(C(=O)NC2CC2)n(CC(F)F)n1
Show InChI InChI=1S/C28H25ClF2N4O3/c1-2-23(36)26-25(16-6-4-3-5-7-16)21-12-17(29)8-11-20(21)28(38)34(26)14-19-13-22(27(37)32-18-9-10-18)35(33-19)15-24(30)31/h3-8,11-13,18,24H,2,9-10,14-15H2,1H3,(H,32,37)
Reactome pathway
n/an/a 1.14E+3n/an/an/an/an/an/a
Takeda Pharmaceutical Company, Ltd
Curated by ChEMBL
Assay Description
Inhibition of JNK1 in rat H9c2 cells assessed as inhibition of anisomycin-induced cJun phosphorylation after 30 mins
Bioorg Med Chem 16: 4699-714 (2008)
Article DOI: 10.1016/j.bmc.2008.02.028
BindingDB Entry DOI: 10.7270/Q2NP2598
Mitogen-activated protein kinase 8
(Homo sapiens (Human))
BDBM50376110
(CHEMBL409350)
Show SMILES CCC(=O)c1c(-c2ccccc2)c2cc(Cl)ccc2c(=O)n1Cc1cc(C(=O)NC2CC2)n(CC(F)F)n1
Show InChI InChI=1S/C28H25ClF2N4O3/c1-2-23(36)26-25(16-6-4-3-5-7-16)21-12-17(29)8-11-20(21)28(38)34(26)14-19-13-22(27(37)32-18-9-10-18)35(33-19)15-24(30)31/h3-8,11-13,18,24H,2,9-10,14-15H2,1H3,(H,32,37)
NCI pathway
Reactome pathway
n/an/a 10n/an/an/an/an/an/a
Takeda Pharmaceutical Company, Ltd
Curated by ChEMBL
Assay Description
Inhibition of human JNK1 by radiometric assay
Bioorg Med Chem 16: 4699-714 (2008)
Article DOI: 10.1016/j.bmc.2008.02.028
BindingDB Entry DOI: 10.7270/Q2NP2598