BDBM50376122 CHEMBL260065
SMILES: CCC(=O)c1c(-c2ccccc2)c2cc(Cl)ccc2c(=O)n1Cc1cc(n(CC(N)=O)n1)S(C)(=O)=O
InChI Key: InChIKey=YKZDEDYDPGYMCN-UHFFFAOYSA-N
Data: 2 IC50
Activity Spreadsheet -- Enzyme Inhibition Constant Data from BindingDB
Found 2 hits for monomerid = 50376122
Trg + Lig
Ki
nM
ΔG°
kcal/mole
IC50
nM
Kd
nM
EC50/IC50
nM
koff
s-1
kon
M-1s-1
pHTemp
°C
Mitogen-activated protein kinase 8
(Homo sapiens (Human))
BDBM50376122
(CHEMBL260065)
Show SMILES CCC(=O)c1c(-c2ccccc2)c2cc(Cl)ccc2c(=O)n1Cc1cc(n(CC(N)=O)n1)S(C)(=O)=O
Show InChI InChI=1S/C25H23ClN4O5S/c1-3-20(31)24-23(15-7-5-4-6-8-15)19-11-16(26)9-10-18(19)25(33)29(24)13-17-12-22(36(2,34)35)30(28-17)14-21(27)32/h4-12H,3,13-14H2,1-2H3,(H2,27,32)
NCI pathway
Reactome pathway
n/an/a 8.20n/an/an/an/an/an/a
Takeda Pharmaceutical Company, Ltd
Curated by ChEMBL
Assay Description
Inhibition of human JNK1 by radiometric assay
Bioorg Med Chem 16: 4699-714 (2008)
Article DOI: 10.1016/j.bmc.2008.02.028
BindingDB Entry DOI: 10.7270/Q2NP2598
Mitogen-activated protein kinase 8
(Rattus norvegicus)
BDBM50376122
(CHEMBL260065)
Show SMILES CCC(=O)c1c(-c2ccccc2)c2cc(Cl)ccc2c(=O)n1Cc1cc(n(CC(N)=O)n1)S(C)(=O)=O
Show InChI InChI=1S/C25H23ClN4O5S/c1-3-20(31)24-23(15-7-5-4-6-8-15)19-11-16(26)9-10-18(19)25(33)29(24)13-17-12-22(36(2,34)35)30(28-17)14-21(27)32/h4-12H,3,13-14H2,1-2H3,(H2,27,32)
Reactome pathway
n/an/a 1.05E+3n/an/an/an/an/an/a
Takeda Pharmaceutical Company, Ltd
Curated by ChEMBL
Assay Description
Inhibition of JNK1 in rat H9c2 cells assessed as inhibition of anisomycin-induced cJun phosphorylation after 30 mins
Bioorg Med Chem 16: 4699-714 (2008)
Article DOI: 10.1016/j.bmc.2008.02.028
BindingDB Entry DOI: 10.7270/Q2NP2598