null
SMILES: Oc1c(Br)cc(\C=C2/CSC\C(=C/c3cc(Br)c(O)c(Br)c3)C2=O)cc1Br
InChI Key: InChIKey=UFMWXPXIXXWVLB-NJDSBKIZSA-N
Activity Spreadsheet -- Enzyme Inhibition Constant Data from BindingDB
Found 1 hit for monomerid = 50376149
Trg + Lig
Ki
nM
ΔG°
kcal/mole
IC50
nM
Kd
nM
EC50/IC50
nM
koff
s-1
kon
M-1s-1
pHTemp
°C
RmtA
(Emericella nidulans)
BDBM50376149
(CHEMBL428637)
Show SMILES Oc1c(Br)cc(\C=C2/CSC\C(=C/c3cc(Br)c(O)c(Br)c3)C2=O)cc1Br
Show InChI InChI=1S/C19H12Br4O3S/c20-13-3-9(4-14(21)18(13)25)1-11-7-27-8-12(17(11)24)2-10-5-15(22)19(26)16(23)6-10/h1-6,25-26H,7-8H2/b11-1+,12-2+
n/an/a 4.50E+4n/an/an/an/an/an/a
Universit£ degli Studi di Roma La Sapienza
Curated by ChEMBL
Assay Description
Inhibition of Aspergillus nidulans RmtA
J Med Chem 51: 2279-90 (2008)
Article DOI: 10.1021/jm701595q
BindingDB Entry DOI: 10.7270/Q28C9X48