BDBM50376469 CHEMBL259269
SMILES: O=C1CC(=Nc2ccc(cc2N1)-c1ccccc1)c1cccc(c1)-n1ccnc1
InChI Key: InChIKey=SKQGWDRAAWPZGQ-UHFFFAOYSA-N
Data: 2 IC50
Activity Spreadsheet -- Enzyme Inhibition Constant Data from BindingDB
Found 2 hits for monomerid = 50376469
Trg + Lig
Ki
nM
ΔG°
kcal/mole
IC50
nM
Kd
nM
EC50/IC50
nM
koff
s-1
kon
M-1s-1
pHTemp
°C
Metabotropic glutamate receptor 2
(Homo sapiens (Human))
BDBM50376469
(CHEMBL259269)
Show SMILES O=C1CC(=Nc2ccc(cc2N1)-c1ccccc1)c1cccc(c1)-n1ccnc1 |c:3|
Show InChI InChI=1S/C24H18N4O/c29-24-15-22(19-7-4-8-20(13-19)28-12-11-25-16-28)26-21-10-9-18(14-23(21)27-24)17-5-2-1-3-6-17/h1-14,16H,15H2,(H,27,29)
n/an/a 39n/an/an/an/an/an/a
F. Hoffmann-La Roche Ltd.
Curated by ChEMBL
Assay Description
Displacement of [3H]LY354740 from rat mGluR2
Bioorg Med Chem Lett 18: 2725-9 (2008)
Article DOI: 10.1016/j.bmcl.2008.02.076
BindingDB Entry DOI: 10.7270/Q2S75H7D
Metabotropic glutamate receptor 2
(Homo sapiens (Human))
BDBM50376469
(CHEMBL259269)
Show SMILES O=C1CC(=Nc2ccc(cc2N1)-c1ccccc1)c1cccc(c1)-n1ccnc1 |c:3|
Show InChI InChI=1S/C24H18N4O/c29-24-15-22(19-7-4-8-20(13-19)28-12-11-25-16-28)26-21-10-9-18(14-23(21)27-24)17-5-2-1-3-6-17/h1-14,16H,15H2,(H,27,29)
n/an/a 47n/an/an/an/an/an/a
F. Hoffmann-La Roche Ltd.
Curated by ChEMBL
Assay Description
Antagonist activity at rat mGluR2 assessed as blockade of (1S,3R)-ACPD-induced inhibition of forskolin-stimulated cAMP production
Bioorg Med Chem Lett 18: 2725-9 (2008)
Article DOI: 10.1016/j.bmcl.2008.02.076
BindingDB Entry DOI: 10.7270/Q2S75H7D