BDBM50376719 CHEMBL258795
SMILES: FC(F)(F)c1cc(OCC(=O)Nc2ccc(cc2)-c2nc3cc(ccc3o2)C#N)ccc1Cl
InChI Key: InChIKey=VBZOOOMZLFEDDD-UHFFFAOYSA-N
Data: 2 IC50
Activity Spreadsheet -- Enzyme Inhibition Constant Data from BindingDB
Found 2 hits for monomerid = 50376719
Trg + Lig
Ki
nM
ΔG°
kcal/mole
IC50
nM
Kd
nM
EC50/IC50
nM
koff
s-1
kon
M-1s-1
pHTemp
°C
Cholesteryl ester transfer protein
(Homo sapiens (Human))
BDBM50376719
(CHEMBL258795)
Show SMILES FC(F)(F)c1cc(OCC(=O)Nc2ccc(cc2)-c2nc3cc(ccc3o2)C#N)ccc1Cl
Show InChI InChI=1S/C23H13ClF3N3O3/c24-18-7-6-16(10-17(18)23(25,26)27)32-12-21(31)29-15-4-2-14(3-5-15)22-30-19-9-13(11-28)1-8-20(19)33-22/h1-10H,12H2,(H,29,31)
Reactome pathway
n/an/a 18n/an/an/an/an/an/a
Bristol-Myers Squibb Pharmaceutical Research Institute
Curated by ChEMBL
Assay Description
Inhibition of human CETP by scintillation proximity assay
Bioorg Med Chem Lett 18: 2640-4 (2008)
Article DOI: 10.1016/j.bmcl.2008.03.030
BindingDB Entry DOI: 10.7270/Q2V40W3V
Cholesteryl ester transfer protein
(Homo sapiens (Human))
BDBM50376719
(CHEMBL258795)
Show SMILES FC(F)(F)c1cc(OCC(=O)Nc2ccc(cc2)-c2nc3cc(ccc3o2)C#N)ccc1Cl
Show InChI InChI=1S/C23H13ClF3N3O3/c24-18-7-6-16(10-17(18)23(25,26)27)32-12-21(31)29-15-4-2-14(3-5-15)22-30-19-9-13(11-28)1-8-20(19)33-22/h1-10H,12H2,(H,29,31)
Reactome pathway
n/an/a 4.30E+3n/an/an/an/an/an/a
Bristol-Myers Squibb Pharmaceutical Research Institute
Curated by ChEMBL
Assay Description
Inhibition of CETP in human whole plasma
Bioorg Med Chem Lett 18: 2640-4 (2008)
Article DOI: 10.1016/j.bmcl.2008.03.030
BindingDB Entry DOI: 10.7270/Q2V40W3V