BDBM50376751 ANTHRANILIC ACID
SMILES: Nc1ccccc1C(O)=O
InChI Key: InChIKey=RWZYAGGXGHYGMB-UHFFFAOYSA-N
Data: 1 IC50
Activity Spreadsheet -- Enzyme Inhibition Constant Data from BindingDB
Found 1 hit for monomerid = 50376751
Trg + Lig
Ki
nM
ΔG°
kcal/mole
IC50
nM
Kd
nM
EC50/IC50
nM
koff
s-1
kon
M-1s-1
pHTemp
°C
Gamma-amino-N-butyrate transaminase
(Homo sapiens (Human))
BDBM50376751
(ANTHRANILIC ACID)
Show SMILES Nc1ccccc1C(O)=O
Show InChI InChI=1S/C7H7NO2/c8-6-4-2-1-3-5(6)7(9)10/h1-4H,8H2,(H,9,10)
Reactome pathway
n/an/a>5.00E+6n/an/an/an/an/an/a
Northwestern University
Curated by ChEMBL
Assay Description
Inhibition of GABA-AT
Bioorg Med Chem Lett 18: 3122-5 (2008)
Article DOI: 10.1016/j.bmcl.2007.10.060
BindingDB Entry DOI: 10.7270/Q22J6CRF