BDBM50376792 CHEMBL261593
SMILES: CCc1cccc(CC)c1-c1cc(OC)c2C(CCCc2n1)N1CCc2ccc(cc2C1)C(F)(F)F
InChI Key: InChIKey=JVKYUESMTWIVHE-UHFFFAOYSA-N
Data: 1 IC50
Activity Spreadsheet -- Enzyme Inhibition Constant Data from BindingDB
Found 1 hit for monomerid = 50376792
Trg + Lig
Ki
nM
ΔG°
kcal/mole
IC50
nM
Kd
nM
EC50/IC50
nM
koff
s-1
kon
M-1s-1
pHTemp
°C
C5a anaphylatoxin chemotactic receptor (C5aR)
(Homo sapiens (Human))
BDBM50376792
(CHEMBL261593)
Show SMILES CCc1cccc(CC)c1-c1cc(OC)c2C(CCCc2n1)N1CCc2ccc(cc2C1)C(F)(F)F |w:16.24|
Show InChI InChI=1S/C30H33F3N2O/c1-4-19-8-6-9-20(5-2)28(19)25-17-27(36-3)29-24(34-25)10-7-11-26(29)35-15-14-21-12-13-23(30(31,32)33)16-22(21)18-35/h6,8-9,12-13,16-17,26H,4-5,7,10-11,14-15,18H2,1-3H3
n/an/a>1.00E+4n/an/an/an/an/an/a
Johnson& Johnson PRD
Curated by ChEMBL
Assay Description
Antagonist activity at human C5a receptor in U937 cells assessed as inhibition of anaphylatoxin-induced intracellular calcium mobilization
Bioorg Med Chem Lett 18: 2544-8 (2008)
Article DOI: 10.1016/j.bmcl.2008.03.049
BindingDB Entry DOI: 10.7270/Q2JM2BHD