BDBM50376829 CHEMBL260476
SMILES: CCN(C1CCCc2nc(cc(OC)c12)-c1c(C)cccc1C)c1cccc2ccccc12
InChI Key: InChIKey=WZHJGVYLHFQMTL-UHFFFAOYSA-N
Data: 1 IC50
Activity Spreadsheet -- Enzyme Inhibition Constant Data from BindingDB
Found 1 hit for monomerid = 50376829
Trg + Lig
Ki
nM
ΔG°
kcal/mole
IC50
nM
Kd
nM
EC50/IC50
nM
koff
s-1
kon
M-1s-1
pHTemp
°C
C5a anaphylatoxin chemotactic receptor (C5aR)
(Homo sapiens (Human))
BDBM50376829
(CHEMBL260476)
Show SMILES CCN(C1CCCc2nc(cc(OC)c12)-c1c(C)cccc1C)c1cccc2ccccc12 |w:3.2|
Show InChI InChI=1S/C30H32N2O/c1-5-32(26-17-9-14-22-13-6-7-15-23(22)26)27-18-10-16-24-30(27)28(33-4)19-25(31-24)29-20(2)11-8-12-21(29)3/h6-9,11-15,17,19,27H,5,10,16,18H2,1-4H3
n/an/a 130n/an/an/an/an/an/a
Johnson& Johnson PRD
Curated by ChEMBL
Assay Description
Antagonist activity at human C5a receptor in U937 cells assessed as inhibition of anaphylatoxin-induced intracellular calcium mobilization
Bioorg Med Chem Lett 18: 2544-8 (2008)
Article DOI: 10.1016/j.bmcl.2008.03.049
BindingDB Entry DOI: 10.7270/Q2JM2BHD