BDBM50376832 CHEMBL408432
SMILES: CCN(C1CCCc2nc(cc(SC)c12)-c1c(CC)cccc1CC)c1cccc2ccccc12
InChI Key: InChIKey=CMLVDJNLTCLQQU-UHFFFAOYSA-N
Data: 1 IC50
Activity Spreadsheet -- Enzyme Inhibition Constant Data from BindingDB
Found 1 hit for monomerid = 50376832
Trg + Lig
Ki
nM
ΔG°
kcal/mole
IC50
nM
Kd
nM
EC50/IC50
nM
koff
s-1
kon
M-1s-1
pHTemp
°C
C5a anaphylatoxin chemotactic receptor (C5aR)
(Homo sapiens (Human))
BDBM50376832
(CHEMBL408432)
Show SMILES CCN(C1CCCc2nc(cc(SC)c12)-c1c(CC)cccc1CC)c1cccc2ccccc12 |w:3.2|
Show InChI InChI=1S/C32H36N2S/c1-5-22-14-10-15-23(6-2)31(22)27-21-30(35-4)32-26(33-27)18-12-20-29(32)34(7-3)28-19-11-16-24-13-8-9-17-25(24)28/h8-11,13-17,19,21,29H,5-7,12,18,20H2,1-4H3
n/an/a 82n/an/an/an/an/an/a
Johnson& Johnson PRD
Curated by ChEMBL
Assay Description
Antagonist activity at human C5a receptor in U937 cells assessed as inhibition of anaphylatoxin-induced intracellular calcium mobilization
Bioorg Med Chem Lett 18: 2544-8 (2008)
Article DOI: 10.1016/j.bmcl.2008.03.049
BindingDB Entry DOI: 10.7270/Q2JM2BHD