BDBM50376833 CHEMBL258797
SMILES: CCN(C1CCCc2nc(cc(OC3CCCC3)c12)-c1c(CC)cccc1CC)c1cccc2ccccc12
InChI Key: InChIKey=QHYHFHIRCVCJMQ-UHFFFAOYSA-N
Data: 1 IC50
Activity Spreadsheet -- Enzyme Inhibition Constant Data from BindingDB
Found 1 hit for monomerid = 50376833
Trg + Lig
Ki
nM
ΔG°
kcal/mole
IC50
nM
Kd
nM
EC50/IC50
nM
koff
s-1
kon
M-1s-1
pHTemp
°C
C5a anaphylatoxin chemotactic receptor (C5aR)
(Homo sapiens (Human))
BDBM50376833
(CHEMBL258797)
Show SMILES CCN(C1CCCc2nc(cc(OC3CCCC3)c12)-c1c(CC)cccc1CC)c1cccc2ccccc12 |w:3.2|
Show InChI InChI=1S/C36H42N2O/c1-4-25-15-11-16-26(5-2)35(25)31-24-34(39-28-18-8-9-19-28)36-30(37-31)21-13-23-33(36)38(6-3)32-22-12-17-27-14-7-10-20-29(27)32/h7,10-12,14-17,20,22,24,28,33H,4-6,8-9,13,18-19,21,23H2,1-3H3
n/an/a 37n/an/an/an/an/an/a
Johnson& Johnson PRD
Curated by ChEMBL
Assay Description
Antagonist activity at human C5a receptor in U937 cells assessed as inhibition of anaphylatoxin-induced intracellular calcium mobilization
Bioorg Med Chem Lett 18: 2544-8 (2008)
Article DOI: 10.1016/j.bmcl.2008.03.049
BindingDB Entry DOI: 10.7270/Q2JM2BHD