BDBM50377170 CHEMBL256570
SMILES: Clc1ccc2ncc(-c3cccc(NC4CCNCC4)n3)n2c1
InChI Key: InChIKey=TWWKXZDIDHDHRF-UHFFFAOYSA-N
Data: 1 IC50
Activity Spreadsheet -- Enzyme Inhibition Constant Data from BindingDB
Found 1 hit for monomerid = 50377170
Trg + Lig
Ki
nM
ΔG°
kcal/mole
IC50
nM
Kd
nM
EC50/IC50
nM
koff
s-1
kon
M-1s-1
pHTemp
°C
Interleukin-1 receptor-associated kinase 4
(Homo sapiens (Human))
BDBM50377170
(CHEMBL256570)
Show SMILES Clc1ccc2ncc(-c3cccc(NC4CCNCC4)n3)n2c1
Show InChI InChI=1S/C17H18ClN5/c18-12-4-5-17-20-10-15(23(17)11-12)14-2-1-3-16(22-14)21-13-6-8-19-9-7-13/h1-5,10-11,13,19H,6-9H2,(H,21,22)
Reactome pathway
n/an/a 1n/an/an/an/an/an/a
UCB
Curated by ChEMBL
Assay Description
Inhibition of IRAK4
Bioorg Med Chem Lett 18: 3656-60 (2008)
Article DOI: 10.1016/j.bmcl.2008.04.042
BindingDB Entry DOI: 10.7270/Q2JH3N2N