BDBM50377181 CHEMBL256963
SMILES: Clc1ccc2ncc(-c3cccc(NC4CNC4)n3)n2c1
InChI Key: InChIKey=RDTAHMIMQLRAMR-UHFFFAOYSA-N
Data: 2 IC50
Activity Spreadsheet -- Enzyme Inhibition Constant Data from BindingDB
Found 2 hits for monomerid = 50377181
Trg + Lig
Ki
nM
ΔG°
kcal/mole
IC50
nM
Kd
nM
EC50/IC50
nM
koff
s-1
kon
M-1s-1
pHTemp
°C
Interleukin-1 receptor-associated kinase 4
(Homo sapiens (Human))
BDBM50377181
(CHEMBL256963)
Show SMILES Clc1ccc2ncc(-c3cccc(NC4CNC4)n3)n2c1
Show InChI InChI=1S/C15H14ClN5/c16-10-4-5-15-18-8-13(21(15)9-10)12-2-1-3-14(20-12)19-11-6-17-7-11/h1-5,8-9,11,17H,6-7H2,(H,19,20)
Reactome pathway
n/an/a 6n/an/an/an/an/an/a
UCB
Curated by ChEMBL
Assay Description
Inhibition of IRAK4
Bioorg Med Chem Lett 18: 3656-60 (2008)
Article DOI: 10.1016/j.bmcl.2008.04.042
BindingDB Entry DOI: 10.7270/Q2JH3N2N
Interleukin-1 receptor-associated kinase 1
(Homo sapiens (Human))
BDBM50377181
(CHEMBL256963)
Show SMILES Clc1ccc2ncc(-c3cccc(NC4CNC4)n3)n2c1
Show InChI InChI=1S/C15H14ClN5/c16-10-4-5-15-18-8-13(21(15)9-10)12-2-1-3-14(20-12)19-11-6-17-7-11/h1-5,8-9,11,17H,6-7H2,(H,19,20)
n/an/a 1.95E+5n/an/an/an/an/an/a
UCB
Curated by ChEMBL
Assay Description
Inhibition of IRAK1
Bioorg Med Chem Lett 18: 3656-60 (2008)
Article DOI: 10.1016/j.bmcl.2008.04.042
BindingDB Entry DOI: 10.7270/Q2JH3N2N