BDBM50377244 CHEMBL256366
SMILES: [O-][N+](=O)c1cnc(Nc2ccccc2)nc1Nc1ccccc1
InChI Key: InChIKey=YKPWNVMTPYXVRJ-UHFFFAOYSA-N
Data: 1 IC50
Activity Spreadsheet -- Enzyme Inhibition Constant Data from BindingDB
Found 1 hit for monomerid = 50377244
Trg + Lig
Ki
nM
ΔG°
kcal/mole
IC50
nM
Kd
nM
EC50/IC50
nM
koff
s-1
kon
M-1s-1
pHTemp
°C
Glycogen synthase kinase-3 beta
(Homo sapiens (Human))
BDBM50377244
(CHEMBL256366)
Show SMILES [O-][N+](=O)c1cnc(Nc2ccccc2)nc1Nc1ccccc1
Show InChI InChI=1S/C16H13N5O2/c22-21(23)14-11-17-16(19-13-9-5-2-6-10-13)20-15(14)18-12-7-3-1-4-8-12/h1-11H,(H2,17,18,19,20)
NCI pathway
Reactome pathway
n/an/a 2.80E+3n/an/an/an/an/an/a
Kemia, Inc.
Curated by ChEMBL
Assay Description
Inhibition of GSK3-beta
Bioorg Med Chem Lett 18: 3578-81 (2008)
Article DOI: 10.1016/j.bmcl.2008.05.001
BindingDB Entry DOI: 10.7270/Q2571CXM