null
SMILES: OC(=O)c1ccc(Nc2ncc3c(Cl)nn(-c4ccccc4)c3n2)cc1
InChI Key: InChIKey=DQKGUOVMKYKFNV-UHFFFAOYSA-N
Activity Spreadsheet -- Enzyme Inhibition Constant Data from BindingDB
Found 2 hits for monomerid = 50377258
Trg + Lig
Ki
nM
ΔG°
kcal/mole
IC50
nM
Kd
nM
EC50/IC50
nM
koff
s-1
kon
M-1s-1
pHTemp
°C
Glycogen synthase kinase-3 beta
(Homo sapiens (Human))
BDBM50377258
(CHEMBL253740)
Show SMILES OC(=O)c1ccc(Nc2ncc3c(Cl)nn(-c4ccccc4)c3n2)cc1
Show InChI InChI=1S/C18H12ClN5O2/c19-15-14-10-20-18(21-12-8-6-11(7-9-12)17(25)26)22-16(14)24(23-15)13-4-2-1-3-5-13/h1-10H,(H,25,26)(H,20,21,22)
NCI pathway
Reactome pathway
n/an/a 180n/an/an/an/an/an/a
Kemia, Inc.
Curated by ChEMBL
Assay Description
Inhibition of GSK3-beta
Bioorg Med Chem Lett 18: 3578-81 (2008)
Article DOI: 10.1016/j.bmcl.2008.05.001
BindingDB Entry DOI: 10.7270/Q2571CXM
Glycogen synthase kinase-3 alpha
(Homo sapiens (Human))
BDBM50377258
(CHEMBL253740)
Show SMILES OC(=O)c1ccc(Nc2ncc3c(Cl)nn(-c4ccccc4)c3n2)cc1
Show InChI InChI=1S/C18H12ClN5O2/c19-15-14-10-20-18(21-12-8-6-11(7-9-12)17(25)26)22-16(14)24(23-15)13-4-2-1-3-5-13/h1-10H,(H,25,26)(H,20,21,22)
NCI pathway
Reactome pathway
n/an/a 350n/an/an/an/an/an/a
Kemia, Inc.
Curated by ChEMBL
Assay Description
Inhibition of GSK3alpha
Bioorg Med Chem Lett 18: 3578-81 (2008)
Article DOI: 10.1016/j.bmcl.2008.05.001
BindingDB Entry DOI: 10.7270/Q2571CXM