BDBM50377273 CHEMBL430031
SMILES: CC(C)CO\N=C\c1c(N)ncnc1Nc1ccc2n(Cc3cccc(F)c3)ncc2c1
InChI Key: InChIKey=FZRBAMDZJYDNRB-VPUKRXIYSA-N
Data: 2 IC50
Activity Spreadsheet -- Enzyme Inhibition Constant Data from BindingDB
Found 2 hits for monomerid = 50377273
Trg + Lig
Ki
nM
ΔG°
kcal/mole
IC50
nM
Kd
nM
EC50/IC50
nM
koff
s-1
kon
M-1s-1
pHTemp
°C
Receptor tyrosine-protein kinase erbB-2
(Homo sapiens (Human))
BDBM50377273
(CHEMBL430031)
Show SMILES CC(C)CO\N=C\c1c(N)ncnc1Nc1ccc2n(Cc3cccc(F)c3)ncc2c1
Show InChI InChI=1S/C23H24FN7O/c1-15(2)13-32-29-11-20-22(25)26-14-27-23(20)30-19-6-7-21-17(9-19)10-28-31(21)12-16-4-3-5-18(24)8-16/h3-11,14-15H,12-13H2,1-2H3,(H3,25,26,27,30)/b29-11+
n/an/a 173n/an/an/an/an/an/a
Johnson& Johnson Pharmaceutical Research& Development
Curated by ChEMBL
Assay Description
Inhibition of ErbB2
Bioorg Med Chem Lett 18: 3495-9 (2008)
Article DOI: 10.1016/j.bmcl.2008.05.024
BindingDB Entry DOI: 10.7270/Q21G0N5V
Epidermal growth factor receptor
(Homo sapiens (Human))
BDBM50377273
(CHEMBL430031)
Show SMILES CC(C)CO\N=C\c1c(N)ncnc1Nc1ccc2n(Cc3cccc(F)c3)ncc2c1
Show InChI InChI=1S/C23H24FN7O/c1-15(2)13-32-29-11-20-22(25)26-14-27-23(20)30-19-6-7-21-17(9-19)10-28-31(21)12-16-4-3-5-18(24)8-16/h3-11,14-15H,12-13H2,1-2H3,(H3,25,26,27,30)/b29-11+
n/an/a 32n/an/an/an/an/an/a
Johnson& Johnson Pharmaceutical Research& Development
Curated by ChEMBL
Assay Description
Inhibition of EGFR
Bioorg Med Chem Lett 18: 3495-9 (2008)
Article DOI: 10.1016/j.bmcl.2008.05.024
BindingDB Entry DOI: 10.7270/Q21G0N5V