BDBM50377286 CHEMBL402293
SMILES: CC(C)O\N=C\c1c(N)ncnc1Nc1ccc2n(Cc3cccc(F)c3)ncc2c1
InChI Key: InChIKey=VBFBOJPZZPXTID-IPBVOBEMSA-N
Data: 2 IC50
Activity Spreadsheet -- Enzyme Inhibition Constant Data from BindingDB
Found 2 hits for monomerid = 50377286
Trg + Lig
Ki
nM
ΔG°
kcal/mole
IC50
nM
Kd
nM
EC50/IC50
nM
koff
s-1
kon
M-1s-1
pHTemp
°C
Epidermal growth factor receptor
(Homo sapiens (Human))
BDBM50377286
(CHEMBL402293)
Show SMILES CC(C)O\N=C\c1c(N)ncnc1Nc1ccc2n(Cc3cccc(F)c3)ncc2c1
Show InChI InChI=1S/C22H22FN7O/c1-14(2)31-28-11-19-21(24)25-13-26-22(19)29-18-6-7-20-16(9-18)10-27-30(20)12-15-4-3-5-17(23)8-15/h3-11,13-14H,12H2,1-2H3,(H3,24,25,26,29)/b28-11+
n/an/a 14n/an/an/an/an/an/a
Johnson& Johnson Pharmaceutical Research& Development
Curated by ChEMBL
Assay Description
Inhibition of EGFR
Bioorg Med Chem Lett 18: 3495-9 (2008)
Article DOI: 10.1016/j.bmcl.2008.05.024
BindingDB Entry DOI: 10.7270/Q21G0N5V
Receptor tyrosine-protein kinase erbB-2
(Homo sapiens (Human))
BDBM50377286
(CHEMBL402293)
Show SMILES CC(C)O\N=C\c1c(N)ncnc1Nc1ccc2n(Cc3cccc(F)c3)ncc2c1
Show InChI InChI=1S/C22H22FN7O/c1-14(2)31-28-11-19-21(24)25-13-26-22(19)29-18-6-7-20-16(9-18)10-27-30(20)12-15-4-3-5-17(23)8-15/h3-11,13-14H,12H2,1-2H3,(H3,24,25,26,29)/b28-11+
n/an/a 25n/an/an/an/an/an/a
Johnson& Johnson Pharmaceutical Research& Development
Curated by ChEMBL
Assay Description
Inhibition of ErbB2
Bioorg Med Chem Lett 18: 3495-9 (2008)
Article DOI: 10.1016/j.bmcl.2008.05.024
BindingDB Entry DOI: 10.7270/Q21G0N5V