BDBM50377349 CHEMBL253745
SMILES: COc1ccc2cc[nH]c2c1-c1cc(C)c2NC(C)(C)CC(C)c2c1Cl
InChI Key: InChIKey=IFFNOGXSDVOOPK-UHFFFAOYSA-N
Data: 4 KI  2 IC50  1 EC50
Activity Spreadsheet -- Enzyme Inhibition Constant Data from BindingDB
Found 7 hits for monomerid = 50377349
Trg + Lig
Ki
nM
ΔG°
kcal/mole
IC50
nM
Kd
nM
EC50/IC50
nM
koff
s-1
kon
M-1s-1
pHTemp
°C
Glucocorticoid receptor
(Homo sapiens (Human))
BDBM50377349
(CHEMBL253745)
Show SMILES COc1ccc2cc[nH]c2c1-c1cc(C)c2NC(C)(C)CC(C)c2c1Cl |w:21.23,(12.35,-42.62,;12.35,-44.16,;11.02,-44.93,;9.69,-44.17,;8.36,-44.94,;8.37,-46.49,;7.24,-47.52,;7.87,-48.91,;9.39,-48.74,;9.7,-47.25,;11.03,-46.48,;12.36,-47.25,;12.36,-48.8,;13.69,-49.57,;13.69,-51.11,;15.02,-48.8,;16.36,-49.58,;17.71,-48.8,;18.1,-50.28,;19.19,-48.4,;17.71,-47.25,;16.37,-46.46,;16.37,-44.92,;15.03,-47.24,;13.68,-46.48,;13.68,-44.94,)|
Show InChI InChI=1S/C22H25ClN2O/c1-12-10-15(18-16(26-5)7-6-14-8-9-24-21(14)18)19(23)17-13(2)11-22(3,4)25-20(12)17/h6-10,13,24-25H,11H2,1-5H3
1.5n/an/an/an/an/an/an/an/a
Ligand Pharmaceuticals
Curated by ChEMBL
Assay Description
Displacement of radiolabeled Dexamethasone from glucocorticoid receptor
Bioorg Med Chem Lett 18: 3504-8 (2008)
Article DOI: 10.1016/j.bmcl.2008.05.029
BindingDB Entry DOI: 10.7270/Q2CR5V8F
Mineralocorticoid receptor
(Homo sapiens (Human))
BDBM50377349
(CHEMBL253745)
Show SMILES COc1ccc2cc[nH]c2c1-c1cc(C)c2NC(C)(C)CC(C)c2c1Cl |w:21.23,(12.35,-42.62,;12.35,-44.16,;11.02,-44.93,;9.69,-44.17,;8.36,-44.94,;8.37,-46.49,;7.24,-47.52,;7.87,-48.91,;9.39,-48.74,;9.7,-47.25,;11.03,-46.48,;12.36,-47.25,;12.36,-48.8,;13.69,-49.57,;13.69,-51.11,;15.02,-48.8,;16.36,-49.58,;17.71,-48.8,;18.1,-50.28,;19.19,-48.4,;17.71,-47.25,;16.37,-46.46,;16.37,-44.92,;15.03,-47.24,;13.68,-46.48,;13.68,-44.94,)|
Show InChI InChI=1S/C22H25ClN2O/c1-12-10-15(18-16(26-5)7-6-14-8-9-24-21(14)18)19(23)17-13(2)11-22(3,4)25-20(12)17/h6-10,13,24-25H,11H2,1-5H3
155n/an/an/an/an/an/an/an/a
Ligand Pharmaceuticals
Curated by ChEMBL
Assay Description
Binding affinity at mineralocorticoid receptor
Bioorg Med Chem Lett 18: 3504-8 (2008)
Article DOI: 10.1016/j.bmcl.2008.05.029
BindingDB Entry DOI: 10.7270/Q2CR5V8F
Progesterone receptor
(Homo sapiens (Human))
BDBM50377349
(CHEMBL253745)
Show SMILES COc1ccc2cc[nH]c2c1-c1cc(C)c2NC(C)(C)CC(C)c2c1Cl |w:21.23,(12.35,-42.62,;12.35,-44.16,;11.02,-44.93,;9.69,-44.17,;8.36,-44.94,;8.37,-46.49,;7.24,-47.52,;7.87,-48.91,;9.39,-48.74,;9.7,-47.25,;11.03,-46.48,;12.36,-47.25,;12.36,-48.8,;13.69,-49.57,;13.69,-51.11,;15.02,-48.8,;16.36,-49.58,;17.71,-48.8,;18.1,-50.28,;19.19,-48.4,;17.71,-47.25,;16.37,-46.46,;16.37,-44.92,;15.03,-47.24,;13.68,-46.48,;13.68,-44.94,)|
Show InChI InChI=1S/C22H25ClN2O/c1-12-10-15(18-16(26-5)7-6-14-8-9-24-21(14)18)19(23)17-13(2)11-22(3,4)25-20(12)17/h6-10,13,24-25H,11H2,1-5H3
1.40E+3n/an/an/an/an/an/an/an/a
Ligand Pharmaceuticals
Curated by ChEMBL
Assay Description
Binding affinity at progesterone receptor
Bioorg Med Chem Lett 18: 3504-8 (2008)
Article DOI: 10.1016/j.bmcl.2008.05.029
BindingDB Entry DOI: 10.7270/Q2CR5V8F
Androgen Receptor
(Homo sapiens (Human))
BDBM50377349
(CHEMBL253745)
Show SMILES COc1ccc2cc[nH]c2c1-c1cc(C)c2NC(C)(C)CC(C)c2c1Cl |w:21.23,(12.35,-42.62,;12.35,-44.16,;11.02,-44.93,;9.69,-44.17,;8.36,-44.94,;8.37,-46.49,;7.24,-47.52,;7.87,-48.91,;9.39,-48.74,;9.7,-47.25,;11.03,-46.48,;12.36,-47.25,;12.36,-48.8,;13.69,-49.57,;13.69,-51.11,;15.02,-48.8,;16.36,-49.58,;17.71,-48.8,;18.1,-50.28,;19.19,-48.4,;17.71,-47.25,;16.37,-46.46,;16.37,-44.92,;15.03,-47.24,;13.68,-46.48,;13.68,-44.94,)|
Show InChI InChI=1S/C22H25ClN2O/c1-12-10-15(18-16(26-5)7-6-14-8-9-24-21(14)18)19(23)17-13(2)11-22(3,4)25-20(12)17/h6-10,13,24-25H,11H2,1-5H3
NCI pathway
Reactome pathway
1.50E+3n/an/an/an/an/an/an/an/a
Ligand Pharmaceuticals
Curated by ChEMBL
Assay Description
Binding affinity at androgen receptor
Bioorg Med Chem Lett 18: 3504-8 (2008)
Article DOI: 10.1016/j.bmcl.2008.05.029
BindingDB Entry DOI: 10.7270/Q2CR5V8F
Glucocorticoid receptor
(Homo sapiens (Human))
BDBM50377349
(CHEMBL253745)
Show SMILES COc1ccc2cc[nH]c2c1-c1cc(C)c2NC(C)(C)CC(C)c2c1Cl |w:21.23,(12.35,-42.62,;12.35,-44.16,;11.02,-44.93,;9.69,-44.17,;8.36,-44.94,;8.37,-46.49,;7.24,-47.52,;7.87,-48.91,;9.39,-48.74,;9.7,-47.25,;11.03,-46.48,;12.36,-47.25,;12.36,-48.8,;13.69,-49.57,;13.69,-51.11,;15.02,-48.8,;16.36,-49.58,;17.71,-48.8,;18.1,-50.28,;19.19,-48.4,;17.71,-47.25,;16.37,-46.46,;16.37,-44.92,;15.03,-47.24,;13.68,-46.48,;13.68,-44.94,)|
Show InChI InChI=1S/C22H25ClN2O/c1-12-10-15(18-16(26-5)7-6-14-8-9-24-21(14)18)19(23)17-13(2)11-22(3,4)25-20(12)17/h6-10,13,24-25H,11H2,1-5H3
n/an/a 33n/an/an/an/an/an/a
Ligand Pharmaceuticals
Curated by ChEMBL
Assay Description
Activity at glucocorticoid receptor assessed as repression of TNFalpha and IL1 beta-induced E-selectin expression
Bioorg Med Chem Lett 18: 3504-8 (2008)
Article DOI: 10.1016/j.bmcl.2008.05.029
BindingDB Entry DOI: 10.7270/Q2CR5V8F
Glucocorticoid receptor
(Homo sapiens (Human))
BDBM50377349
(CHEMBL253745)
Show SMILES COc1ccc2cc[nH]c2c1-c1cc(C)c2NC(C)(C)CC(C)c2c1Cl |w:21.23,(12.35,-42.62,;12.35,-44.16,;11.02,-44.93,;9.69,-44.17,;8.36,-44.94,;8.37,-46.49,;7.24,-47.52,;7.87,-48.91,;9.39,-48.74,;9.7,-47.25,;11.03,-46.48,;12.36,-47.25,;12.36,-48.8,;13.69,-49.57,;13.69,-51.11,;15.02,-48.8,;16.36,-49.58,;17.71,-48.8,;18.1,-50.28,;19.19,-48.4,;17.71,-47.25,;16.37,-46.46,;16.37,-44.92,;15.03,-47.24,;13.68,-46.48,;13.68,-44.94,)|
Show InChI InChI=1S/C22H25ClN2O/c1-12-10-15(18-16(26-5)7-6-14-8-9-24-21(14)18)19(23)17-13(2)11-22(3,4)25-20(12)17/h6-10,13,24-25H,11H2,1-5H3
n/an/an/an/a 4.80E+4n/an/an/an/a
Ligand Pharmaceuticals
Curated by ChEMBL
Assay Description
Agonist activity at glucocorticoid receptor assessed as glucose repsponse element transcriptional transactivation by luciferase assay
Bioorg Med Chem Lett 18: 3504-8 (2008)
Article DOI: 10.1016/j.bmcl.2008.05.029
BindingDB Entry DOI: 10.7270/Q2CR5V8F
Glucocorticoid receptor
(Homo sapiens (Human))
BDBM50377349
(CHEMBL253745)
Show SMILES COc1ccc2cc[nH]c2c1-c1cc(C)c2NC(C)(C)CC(C)c2c1Cl |w:21.23,(12.35,-42.62,;12.35,-44.16,;11.02,-44.93,;9.69,-44.17,;8.36,-44.94,;8.37,-46.49,;7.24,-47.52,;7.87,-48.91,;9.39,-48.74,;9.7,-47.25,;11.03,-46.48,;12.36,-47.25,;12.36,-48.8,;13.69,-49.57,;13.69,-51.11,;15.02,-48.8,;16.36,-49.58,;17.71,-48.8,;18.1,-50.28,;19.19,-48.4,;17.71,-47.25,;16.37,-46.46,;16.37,-44.92,;15.03,-47.24,;13.68,-46.48,;13.68,-44.94,)|
Show InChI InChI=1S/C22H25ClN2O/c1-12-10-15(18-16(26-5)7-6-14-8-9-24-21(14)18)19(23)17-13(2)11-22(3,4)25-20(12)17/h6-10,13,24-25H,11H2,1-5H3
n/an/a>1.00E+3n/an/an/an/an/an/a
Ligand Pharmaceuticals
Curated by ChEMBL
Assay Description
Antagonist activity at glucocorticoid receptor assessed as inhibition of dexamethasone-induced glucose response element transcriptional transactivati...
Bioorg Med Chem Lett 18: 3504-8 (2008)
Article DOI: 10.1016/j.bmcl.2008.05.029
BindingDB Entry DOI: 10.7270/Q2CR5V8F