null
SMILES: OC[C@@H]1COc2cc3[nH]c(=O)cc(c3cc2N1CC(F)(F)F)C(F)(F)F
InChI Key: InChIKey=SVKIYJFOWYPEHJ-SSDOTTSWSA-N
Activity Spreadsheet -- Enzyme Inhibition Constant Data from BindingDB
Found 3 hits for monomerid = 50377409
Trg + Lig
Ki
nM
ΔG°
kcal/mole
IC50
nM
Kd
nM
EC50/IC50
nM
koff
s-1
kon
M-1s-1
pHTemp
°C
Androgen receptor
(Homo sapiens (Human))
BDBM50377409
(CHEMBL404512)
Show SMILES OC[C@@H]1COc2cc3[nH]c(=O)cc(c3cc2N1CC(F)(F)F)C(F)(F)F
Show InChI InChI=1S/C15H12F6N2O3/c16-14(17,18)6-23-7(4-24)5-26-12-3-10-8(1-11(12)23)9(15(19,20)21)2-13(25)22-10/h1-3,7,24H,4-6H2,(H,22,25)/t7-/m1/s1
NCI pathway
Reactome pathway
15n/an/an/an/an/an/an/an/a
Ligand Pharmaceuticals
Curated by ChEMBL
Assay Description
Displacement of [3H]DHT from human Androgen receptor in human MDA-MB-453 cells
Bioorg Med Chem Lett 18: 2967-71 (2008)
Article DOI: 10.1016/j.bmcl.2008.03.062
BindingDB Entry DOI: 10.7270/Q2R2128X
Androgen receptor
(Homo sapiens (Human))
BDBM50377409
(CHEMBL404512)
Show SMILES OC[C@@H]1COc2cc3[nH]c(=O)cc(c3cc2N1CC(F)(F)F)C(F)(F)F
Show InChI InChI=1S/C15H12F6N2O3/c16-14(17,18)6-23-7(4-24)5-26-12-3-10-8(1-11(12)23)9(15(19,20)21)2-13(25)22-10/h1-3,7,24H,4-6H2,(H,22,25)/t7-/m1/s1
NCI pathway
Reactome pathway
n/an/a 60n/an/an/an/an/an/a
Ligand Pharmaceuticals
Curated by ChEMBL
Assay Description
Antagonist activity at human androgen receptor in CV1 cells by transcriptional activation assay
Bioorg Med Chem Lett 18: 2967-71 (2008)
Article DOI: 10.1016/j.bmcl.2008.03.062
BindingDB Entry DOI: 10.7270/Q2R2128X
Androgen receptor
(Homo sapiens (Human))
BDBM50377409
(CHEMBL404512)
Show SMILES OC[C@@H]1COc2cc3[nH]c(=O)cc(c3cc2N1CC(F)(F)F)C(F)(F)F
Show InChI InChI=1S/C15H12F6N2O3/c16-14(17,18)6-23-7(4-24)5-26-12-3-10-8(1-11(12)23)9(15(19,20)21)2-13(25)22-10/h1-3,7,24H,4-6H2,(H,22,25)/t7-/m1/s1
NCI pathway
Reactome pathway
n/an/an/an/a 11n/an/an/an/a
Ligand Pharmaceuticals
Curated by ChEMBL
Assay Description
Agonist activity at human androgen receptor in CV1 cells by transcriptional activation assay
Bioorg Med Chem Lett 18: 2967-71 (2008)
Article DOI: 10.1016/j.bmcl.2008.03.062
BindingDB Entry DOI: 10.7270/Q2R2128X