BDBM50377420 CHEMBL256126
SMILES: FC(F)(F)CN1C(CC#N)COc2cc3[nH]c(=O)cc(c3cc12)C(F)(F)F
InChI Key: InChIKey=MYVMWZVGIURZKT-UHFFFAOYSA-N
Data: 1 KI  1 EC50
Activity Spreadsheet -- Enzyme Inhibition Constant Data from BindingDB
Found 2 hits for monomerid = 50377420
Trg + Lig
Ki
nM
ΔG°
kcal/mole
IC50
nM
Kd
nM
EC50/IC50
nM
koff
s-1
kon
M-1s-1
pHTemp
°C
Androgen receptor
(Homo sapiens (Human))
BDBM50377420
(CHEMBL256126)
Show SMILES FC(F)(F)CN1C(CC#N)COc2cc3[nH]c(=O)cc(c3cc12)C(F)(F)F |w:6.6|
Show InChI InChI=1S/C16H11F6N3O2/c17-15(18,19)7-25-8(1-2-23)6-27-13-5-11-9(3-12(13)25)10(16(20,21)22)4-14(26)24-11/h3-5,8H,1,6-7H2,(H,24,26)
NCI pathway
Reactome pathway
18n/an/an/an/an/an/an/an/a
Ligand Pharmaceuticals
Curated by ChEMBL
Assay Description
Displacement of [3H]DHT from human Androgen receptor in human MDA-MB-453 cells
Bioorg Med Chem Lett 18: 2967-71 (2008)
Article DOI: 10.1016/j.bmcl.2008.03.062
BindingDB Entry DOI: 10.7270/Q2R2128X
Androgen receptor
(Homo sapiens (Human))
BDBM50377420
(CHEMBL256126)
Show SMILES FC(F)(F)CN1C(CC#N)COc2cc3[nH]c(=O)cc(c3cc12)C(F)(F)F |w:6.6|
Show InChI InChI=1S/C16H11F6N3O2/c17-15(18,19)7-25-8(1-2-23)6-27-13-5-11-9(3-12(13)25)10(16(20,21)22)4-14(26)24-11/h3-5,8H,1,6-7H2,(H,24,26)
NCI pathway
Reactome pathway
n/an/an/an/a 30n/an/an/an/a
Ligand Pharmaceuticals
Curated by ChEMBL
Assay Description
Agonist activity at human androgen receptor in CV1 cells by transcriptional activation assay
Bioorg Med Chem Lett 18: 2967-71 (2008)
Article DOI: 10.1016/j.bmcl.2008.03.062
BindingDB Entry DOI: 10.7270/Q2R2128X