BDBM50377425 CHEMBL402039
SMILES: COC[C@@H]1COc2cc3[nH]c(=O)cc(c3cc2N1CC(F)(F)F)C(F)(F)F
InChI Key: InChIKey=AQSBEEWBLQXYER-MRVPVSSYSA-N
Data: 1 KI  1 EC50
Activity Spreadsheet -- Enzyme Inhibition Constant Data from BindingDB
Found 2 hits for monomerid = 50377425
Trg + Lig
Ki
nM
ΔG°
kcal/mole
IC50
nM
Kd
nM
EC50/IC50
nM
koff
s-1
kon
M-1s-1
pHTemp
°C
Androgen receptor
(Homo sapiens (Human))
BDBM50377425
(CHEMBL402039)
Show SMILES COC[C@@H]1COc2cc3[nH]c(=O)cc(c3cc2N1CC(F)(F)F)C(F)(F)F
Show InChI InChI=1S/C16H14F6N2O3/c1-26-5-8-6-27-13-4-11-9(2-12(13)24(8)7-15(17,18)19)10(16(20,21)22)3-14(25)23-11/h2-4,8H,5-7H2,1H3,(H,23,25)/t8-/m1/s1
NCI pathway
Reactome pathway
9.40n/an/an/an/an/an/an/an/a
Ligand Pharmaceuticals
Curated by ChEMBL
Assay Description
Displacement of [3H]DHT from human Androgen receptor in human MDA-MB-453 cells
Bioorg Med Chem Lett 18: 2967-71 (2008)
Article DOI: 10.1016/j.bmcl.2008.03.062
BindingDB Entry DOI: 10.7270/Q2R2128X
Androgen receptor
(Homo sapiens (Human))
BDBM50377425
(CHEMBL402039)
Show SMILES COC[C@@H]1COc2cc3[nH]c(=O)cc(c3cc2N1CC(F)(F)F)C(F)(F)F
Show InChI InChI=1S/C16H14F6N2O3/c1-26-5-8-6-27-13-4-11-9(2-12(13)24(8)7-15(17,18)19)10(16(20,21)22)3-14(25)23-11/h2-4,8H,5-7H2,1H3,(H,23,25)/t8-/m1/s1
NCI pathway
Reactome pathway
n/an/an/an/a 2n/an/an/an/a
Ligand Pharmaceuticals
Curated by ChEMBL
Assay Description
Agonist activity at human androgen receptor in CV1 cells by transcriptional activation assay
Bioorg Med Chem Lett 18: 2967-71 (2008)
Article DOI: 10.1016/j.bmcl.2008.03.062
BindingDB Entry DOI: 10.7270/Q2R2128X