BDBM50377475 CHEMBL406049
SMILES: CC(C)(C)c1nc(-c2nccs2)c2sccc2n1
InChI Key: InChIKey=JDGVLPPKIZVIOR-UHFFFAOYSA-N
Data: 2 KI  1 EC50
Activity Spreadsheet -- Enzyme Inhibition Constant Data from BindingDB
Found 3 hits for monomerid = 50377475
Trg + Lig
Ki
nM
ΔG°
kcal/mole
IC50
nM
Kd
nM
EC50/IC50
nM
koff
s-1
kon
M-1s-1
pHTemp
°C
Adenosine receptor A2a
(Homo sapiens (Human))
BDBM50377475
(CHEMBL406049)
Show SMILES CC(C)(C)c1nc(-c2nccs2)c2sccc2n1
Show InChI InChI=1S/C13H13N3S2/c1-13(2,3)12-15-8-4-6-17-10(8)9(16-12)11-14-5-7-18-11/h4-7H,1-3H3
NCI pathway
Reactome pathway
3.10n/an/an/an/an/an/an/an/a
Vernalis (R&D) Ltd
Curated by ChEMBL
Assay Description
Binding affinity at human adenosine A2A receptor
Bioorg Med Chem Lett 18: 2920-3 (2008)
Article DOI: 10.1016/j.bmcl.2008.03.076
BindingDB Entry DOI: 10.7270/Q270829P
Adenosine receptor A1
(Homo sapiens (Human))
BDBM50377475
(CHEMBL406049)
Show SMILES CC(C)(C)c1nc(-c2nccs2)c2sccc2n1
Show InChI InChI=1S/C13H13N3S2/c1-13(2,3)12-15-8-4-6-17-10(8)9(16-12)11-14-5-7-18-11/h4-7H,1-3H3
Reactome pathway
240n/an/an/an/an/an/an/an/a
Vernalis (R&D) Ltd
Curated by ChEMBL
Assay Description
Binding affinity at human adenosine A1 receptor
Bioorg Med Chem Lett 18: 2920-3 (2008)
Article DOI: 10.1016/j.bmcl.2008.03.076
BindingDB Entry DOI: 10.7270/Q270829P
Adenosine receptor A2a
(Homo sapiens (Human))
BDBM50377475
(CHEMBL406049)
Show SMILES CC(C)(C)c1nc(-c2nccs2)c2sccc2n1
Show InChI InChI=1S/C13H13N3S2/c1-13(2,3)12-15-8-4-6-17-10(8)9(16-12)11-14-5-7-18-11/h4-7H,1-3H3
NCI pathway
Reactome pathway
n/an/an/an/a>1.00E+4n/an/an/an/a
Vernalis (R&D) Ltd
Curated by ChEMBL
Assay Description
Agonist activity at human recombinant adenosine A2A receptor expressed in CHO cells assessed as calcium mobilization by FLIPR assay
Bioorg Med Chem Lett 18: 2920-3 (2008)
Article DOI: 10.1016/j.bmcl.2008.03.076
BindingDB Entry DOI: 10.7270/Q270829P