BDBM50377600 CHEMBL261657
SMILES: Cc1ccc(cc1)C(=NNC(N)=S)c1cc(cc(c1)C(F)(F)F)C(F)(F)F
InChI Key: InChIKey=KQRXZKZSIDZXHU-UHFFFAOYSA-N
Data: 2 IC50
Activity Spreadsheet -- Enzyme Inhibition Constant Data from BindingDB
Found 2 hits for monomerid = 50377600
Trg + Lig
Ki
nM
ΔG°
kcal/mole
IC50
nM
Kd
nM
EC50/IC50
nM
koff
s-1
kon
M-1s-1
pHTemp
°C
Procathepsin L
(Homo sapiens (Human))
BDBM50377600
(CHEMBL261657)
Show SMILES Cc1ccc(cc1)C(=NNC(N)=S)c1cc(cc(c1)C(F)(F)F)C(F)(F)F |w:8.9|
Show InChI InChI=1S/C17H13F6N3S/c1-9-2-4-10(5-3-9)14(25-26-15(24)27)11-6-12(16(18,19)20)8-13(7-11)17(21,22)23/h2-8H,1H3,(H3,24,26,27)
Reactome pathway
n/an/a 7.40n/an/an/an/an/an/a
University of California
Curated by ChEMBL
Assay Description
Inhibition of human cathepsin L
Bioorg Med Chem Lett 18: 2883-5 (2008)
Article DOI: 10.1016/j.bmcl.2008.03.083
BindingDB Entry DOI: 10.7270/Q2Q24150
Cathepsin B
(Homo sapiens (Human))
BDBM50377600
(CHEMBL261657)
Show SMILES Cc1ccc(cc1)C(=NNC(N)=S)c1cc(cc(c1)C(F)(F)F)C(F)(F)F |w:8.9|
Show InChI InChI=1S/C17H13F6N3S/c1-9-2-4-10(5-3-9)14(25-26-15(24)27)11-6-12(16(18,19)20)8-13(7-11)17(21,22)23/h2-8H,1H3,(H3,24,26,27)
Reactome pathway
n/an/a 3.30E+3n/an/an/an/an/an/a
University of California
Curated by ChEMBL
Assay Description
Inhibition of human cathepsin B
Bioorg Med Chem Lett 18: 2883-5 (2008)
Article DOI: 10.1016/j.bmcl.2008.03.083
BindingDB Entry DOI: 10.7270/Q2Q24150