BDBM50377706 CHEMBL256110
SMILES: Cc1ccc(cc1S(=O)(=O)N1CCOCC1)C(=O)NC1C2CC3CC(C2)CC1C3
InChI Key: InChIKey=ZHZOQUQDUAAVIE-UHFFFAOYSA-N
Data: 2 KI  2 EC50
Activity Spreadsheet -- Enzyme Inhibition Constant Data from BindingDB
Found 4 hits for monomerid = 50377706
Trg + Lig
Ki
nM
ΔG°
kcal/mole
IC50
nM
Kd
nM
EC50/IC50
nM
koff
s-1
kon
M-1s-1
pHTemp
°C
Cannabinoid receptor 2
(Homo sapiens (Human))
BDBM50377706
(CHEMBL256110)
Show SMILES Cc1ccc(cc1S(=O)(=O)N1CCOCC1)C(=O)NC1C2CC3CC(C2)CC1C3 |TLB:18:19:21:25.23.24,THB:23:22:19:25.24.26,23:24:21.22.28:19,26:24:21:28.27.19,26:27:21:25.23.24,(25.81,-25.08,;25.81,-26.62,;24.48,-27.39,;24.48,-28.93,;25.82,-29.71,;27.16,-28.93,;27.15,-27.38,;28.48,-26.61,;29.26,-27.94,;27.71,-25.28,;29.81,-25.83,;31.15,-26.59,;32.48,-25.81,;32.47,-24.27,;31.13,-23.51,;29.8,-24.29,;25.82,-31.25,;24.48,-32.01,;27.15,-32.02,;27.19,-33.56,;25.99,-34.46,;24.26,-34.26,;25.48,-35.21,;25.88,-36.67,;27.5,-36.72,;26.4,-35.81,;28.74,-35.82,;28.36,-34.36,;26.76,-34.26,)|
Show InChI InChI=1S/C22H30N2O4S/c1-14-2-3-17(13-20(14)29(26,27)24-4-6-28-7-5-24)22(25)23-21-18-9-15-8-16(11-18)12-19(21)10-15/h2-3,13,15-16,18-19,21H,4-12H2,1H3,(H,23,25)
Reactome pathway
5.60n/an/an/an/an/an/an/an/a
Adolor Corporation
Curated by ChEMBL
Assay Description
Displacement of [3H]CP-55940 from human cloned CB2 receptor
Bioorg Med Chem Lett 18: 2830-5 (2008)
Article DOI: 10.1016/j.bmcl.2008.04.006
BindingDB Entry DOI: 10.7270/Q2P2701M
Cannabinoid receptor 1
(Homo sapiens (Human))
BDBM50377706
(CHEMBL256110)
Show SMILES Cc1ccc(cc1S(=O)(=O)N1CCOCC1)C(=O)NC1C2CC3CC(C2)CC1C3 |TLB:18:19:21:25.23.24,THB:23:22:19:25.24.26,23:24:21.22.28:19,26:24:21:28.27.19,26:27:21:25.23.24,(25.81,-25.08,;25.81,-26.62,;24.48,-27.39,;24.48,-28.93,;25.82,-29.71,;27.16,-28.93,;27.15,-27.38,;28.48,-26.61,;29.26,-27.94,;27.71,-25.28,;29.81,-25.83,;31.15,-26.59,;32.48,-25.81,;32.47,-24.27,;31.13,-23.51,;29.8,-24.29,;25.82,-31.25,;24.48,-32.01,;27.15,-32.02,;27.19,-33.56,;25.99,-34.46,;24.26,-34.26,;25.48,-35.21,;25.88,-36.67,;27.5,-36.72,;26.4,-35.81,;28.74,-35.82,;28.36,-34.36,;26.76,-34.26,)|
Show InChI InChI=1S/C22H30N2O4S/c1-14-2-3-17(13-20(14)29(26,27)24-4-6-28-7-5-24)22(25)23-21-18-9-15-8-16(11-18)12-19(21)10-15/h2-3,13,15-16,18-19,21H,4-12H2,1H3,(H,23,25)
NCI pathway
Reactome pathway
33n/an/an/an/an/an/an/an/a
Adolor Corporation
Curated by ChEMBL
Assay Description
Displacement of [3H]CP-55940 from human cloned CB1 receptor
Bioorg Med Chem Lett 18: 2830-5 (2008)
Article DOI: 10.1016/j.bmcl.2008.04.006
BindingDB Entry DOI: 10.7270/Q2P2701M
Cannabinoid receptor 1
(Homo sapiens (Human))
BDBM50377706
(CHEMBL256110)
Show SMILES Cc1ccc(cc1S(=O)(=O)N1CCOCC1)C(=O)NC1C2CC3CC(C2)CC1C3 |TLB:18:19:21:25.23.24,THB:23:22:19:25.24.26,23:24:21.22.28:19,26:24:21:28.27.19,26:27:21:25.23.24,(25.81,-25.08,;25.81,-26.62,;24.48,-27.39,;24.48,-28.93,;25.82,-29.71,;27.16,-28.93,;27.15,-27.38,;28.48,-26.61,;29.26,-27.94,;27.71,-25.28,;29.81,-25.83,;31.15,-26.59,;32.48,-25.81,;32.47,-24.27,;31.13,-23.51,;29.8,-24.29,;25.82,-31.25,;24.48,-32.01,;27.15,-32.02,;27.19,-33.56,;25.99,-34.46,;24.26,-34.26,;25.48,-35.21,;25.88,-36.67,;27.5,-36.72,;26.4,-35.81,;28.74,-35.82,;28.36,-34.36,;26.76,-34.26,)|
Show InChI InChI=1S/C22H30N2O4S/c1-14-2-3-17(13-20(14)29(26,27)24-4-6-28-7-5-24)22(25)23-21-18-9-15-8-16(11-18)12-19(21)10-15/h2-3,13,15-16,18-19,21H,4-12H2,1H3,(H,23,25)
NCI pathway
Reactome pathway
n/an/an/an/a 270n/an/an/an/a
Adolor Corporation
Curated by ChEMBL
Assay Description
Agonist activity at human cloned CB1 receptor by [35S]GTPgammaS binding assay
Bioorg Med Chem Lett 18: 2830-5 (2008)
Article DOI: 10.1016/j.bmcl.2008.04.006
BindingDB Entry DOI: 10.7270/Q2P2701M
Cannabinoid receptor 2
(Homo sapiens (Human))
BDBM50377706
(CHEMBL256110)
Show SMILES Cc1ccc(cc1S(=O)(=O)N1CCOCC1)C(=O)NC1C2CC3CC(C2)CC1C3 |TLB:18:19:21:25.23.24,THB:23:22:19:25.24.26,23:24:21.22.28:19,26:24:21:28.27.19,26:27:21:25.23.24,(25.81,-25.08,;25.81,-26.62,;24.48,-27.39,;24.48,-28.93,;25.82,-29.71,;27.16,-28.93,;27.15,-27.38,;28.48,-26.61,;29.26,-27.94,;27.71,-25.28,;29.81,-25.83,;31.15,-26.59,;32.48,-25.81,;32.47,-24.27,;31.13,-23.51,;29.8,-24.29,;25.82,-31.25,;24.48,-32.01,;27.15,-32.02,;27.19,-33.56,;25.99,-34.46,;24.26,-34.26,;25.48,-35.21,;25.88,-36.67,;27.5,-36.72,;26.4,-35.81,;28.74,-35.82,;28.36,-34.36,;26.76,-34.26,)|
Show InChI InChI=1S/C22H30N2O4S/c1-14-2-3-17(13-20(14)29(26,27)24-4-6-28-7-5-24)22(25)23-21-18-9-15-8-16(11-18)12-19(21)10-15/h2-3,13,15-16,18-19,21H,4-12H2,1H3,(H,23,25)
Reactome pathway
n/an/an/an/a 12n/an/an/an/a
Adolor Corporation
Curated by ChEMBL
Assay Description
Agonist activity at human cloned CB2 receptor by [35S]GTP-gamma-S binding assay
Bioorg Med Chem Lett 18: 2830-5 (2008)
Article DOI: 10.1016/j.bmcl.2008.04.006
BindingDB Entry DOI: 10.7270/Q2P2701M