BDBM50377710 CHEMBL256753
SMILES: CC1(C)[C@H]2CC[C@](C)(C2)[C@@H]1NC(=O)c1ccc(Br)c(c1)S(=O)(=O)N1CCCC1
InChI Key: InChIKey=DARUPYPUJIPCQB-NYSBEXSLSA-N
Data: 2 KI  2 EC50
Activity Spreadsheet -- Enzyme Inhibition Constant Data from BindingDB
Found 4 hits for monomerid = 50377710
Trg + Lig
Ki
nM
ΔG°
kcal/mole
IC50
nM
Kd
nM
EC50/IC50
nM
koff
s-1
kon
M-1s-1
pHTemp
°C
Cannabinoid receptor 2
(Homo sapiens (Human))
BDBM50377710
(CHEMBL256753)
Show SMILES CC1(C)[C@H]2CC[C@](C)(C2)[C@@H]1NC(=O)c1ccc(Br)c(c1)S(=O)(=O)N1CCCC1 |THB:10:9:4.5:8|
Show InChI InChI=1S/C21H29BrN2O3S/c1-20(2)15-8-9-21(3,13-15)19(20)23-18(25)14-6-7-16(22)17(12-14)28(26,27)24-10-4-5-11-24/h6-7,12,15,19H,4-5,8-11,13H2,1-3H3,(H,23,25)/t15-,19+,21+/m0/s1
Reactome pathway
9.40n/an/an/an/an/an/an/an/a
Adolor Corporation
Curated by ChEMBL
Assay Description
Displacement of [3H]CP-55940 from human cloned CB2 receptor
Bioorg Med Chem Lett 18: 2830-5 (2008)
Article DOI: 10.1016/j.bmcl.2008.04.006
BindingDB Entry DOI: 10.7270/Q2P2701M
Cannabinoid receptor 1
(Homo sapiens (Human))
BDBM50377710
(CHEMBL256753)
Show SMILES CC1(C)[C@H]2CC[C@](C)(C2)[C@@H]1NC(=O)c1ccc(Br)c(c1)S(=O)(=O)N1CCCC1 |THB:10:9:4.5:8|
Show InChI InChI=1S/C21H29BrN2O3S/c1-20(2)15-8-9-21(3,13-15)19(20)23-18(25)14-6-7-16(22)17(12-14)28(26,27)24-10-4-5-11-24/h6-7,12,15,19H,4-5,8-11,13H2,1-3H3,(H,23,25)/t15-,19+,21+/m0/s1
NCI pathway
Reactome pathway
110n/an/an/an/an/an/an/an/a
Adolor Corporation
Curated by ChEMBL
Assay Description
Displacement of [3H]CP-55940 from human cloned CB1 receptor
Bioorg Med Chem Lett 18: 2830-5 (2008)
Article DOI: 10.1016/j.bmcl.2008.04.006
BindingDB Entry DOI: 10.7270/Q2P2701M
Cannabinoid receptor 1
(Homo sapiens (Human))
BDBM50377710
(CHEMBL256753)
Show SMILES CC1(C)[C@H]2CC[C@](C)(C2)[C@@H]1NC(=O)c1ccc(Br)c(c1)S(=O)(=O)N1CCCC1 |THB:10:9:4.5:8|
Show InChI InChI=1S/C21H29BrN2O3S/c1-20(2)15-8-9-21(3,13-15)19(20)23-18(25)14-6-7-16(22)17(12-14)28(26,27)24-10-4-5-11-24/h6-7,12,15,19H,4-5,8-11,13H2,1-3H3,(H,23,25)/t15-,19+,21+/m0/s1
NCI pathway
Reactome pathway
n/an/an/an/a 220n/an/an/an/a
Adolor Corporation
Curated by ChEMBL
Assay Description
Agonist activity at human cloned CB1 receptor by [35S]GTPgammaS binding assay
Bioorg Med Chem Lett 18: 2830-5 (2008)
Article DOI: 10.1016/j.bmcl.2008.04.006
BindingDB Entry DOI: 10.7270/Q2P2701M
Cannabinoid receptor 2
(Homo sapiens (Human))
BDBM50377710
(CHEMBL256753)
Show SMILES CC1(C)[C@H]2CC[C@](C)(C2)[C@@H]1NC(=O)c1ccc(Br)c(c1)S(=O)(=O)N1CCCC1 |THB:10:9:4.5:8|
Show InChI InChI=1S/C21H29BrN2O3S/c1-20(2)15-8-9-21(3,13-15)19(20)23-18(25)14-6-7-16(22)17(12-14)28(26,27)24-10-4-5-11-24/h6-7,12,15,19H,4-5,8-11,13H2,1-3H3,(H,23,25)/t15-,19+,21+/m0/s1
Reactome pathway
n/an/an/an/a 4.30n/an/an/an/a
Adolor Corporation
Curated by ChEMBL
Assay Description
Agonist activity at human cloned CB2 receptor by [35S]GTP-gamma-S binding assay
Bioorg Med Chem Lett 18: 2830-5 (2008)
Article DOI: 10.1016/j.bmcl.2008.04.006
BindingDB Entry DOI: 10.7270/Q2P2701M