BDBM50377930 Benzylpenicillin Sodium::PENICILLIN G SODIUM
SMILES: CC1(C)S[C@@H]2[C@H](NC(=O)Cc3ccccc3)C(=O)N2[C@H]1C([O-])=O
InChI Key: InChIKey=JGSARLDLIJGVTE-MBNYWOFBSA-M
Data: 2 KI  2 IC50
Activity Spreadsheet -- Enzyme Inhibition Constant Data from BindingDB
Found 4 hits for monomerid = 50377930
Trg + Lig
Ki
nM
ΔG°
kcal/mole
IC50
nM
Kd
nM
EC50/IC50
nM
koff
s-1
kon
M-1s-1
pHTemp
°C
Solute carrier family 22 member 6
(Mus musculus)
BDBM50377930
(Benzylpenicillin Sodium | PENICILLIN G SODIUM)
Show SMILES CC1(C)S[C@@H]2[C@H](NC(=O)Cc3ccccc3)C(=O)N2[C@H]1C([O-])=O |r|
Show InChI InChI=1S/C16H18N2O4S/c1-16(2)12(15(21)22)18-13(20)11(14(18)23-16)17-10(19)8-9-6-4-3-5-7-9/h3-7,11-12,14H,8H2,1-2H3,(H,17,19)(H,21,22)/p-1/t11-,12+,14-/m1/s1
Reactome pathway
3.28E+5n/an/an/an/an/an/an/an/a
University of California
Curated by ChEMBL
Assay Description
Inhibition of mouse Oat1-mediated [3H]PAH uptake in Xenopus oocytes after 1 hr
J Biol Chem 282: 23841-53 (2007)
Article DOI: 10.1074/jbc.M703467200
BindingDB Entry DOI: 10.7270/Q2W95B35
Solute carrier family 22 member 20
(Mus musculus)
BDBM50377930
(Benzylpenicillin Sodium | PENICILLIN G SODIUM)
Show SMILES CC1(C)S[C@@H]2[C@H](NC(=O)Cc3ccccc3)C(=O)N2[C@H]1C([O-])=O |r|
Show InChI InChI=1S/C16H18N2O4S/c1-16(2)12(15(21)22)18-13(20)11(14(18)23-16)17-10(19)8-9-6-4-3-5-7-9/h3-7,11-12,14H,8H2,1-2H3,(H,17,19)(H,21,22)/p-1/t11-,12+,14-/m1/s1
4.57E+5n/an/an/an/an/an/an/an/a
University of California
Curated by ChEMBL
Assay Description
Inhibition of mouse Oat6-mediated [3H]ES uptake in Xenopus oocytes after 1 hr
J Biol Chem 282: 23841-53 (2007)
Article DOI: 10.1074/jbc.M703467200
BindingDB Entry DOI: 10.7270/Q2W95B35
Beta-lactamase
(Enterobacter cloacae)
BDBM50377930
(Benzylpenicillin Sodium | PENICILLIN G SODIUM)
Show SMILES CC1(C)S[C@@H]2[C@H](NC(=O)Cc3ccccc3)C(=O)N2[C@H]1C([O-])=O |r|
Show InChI InChI=1S/C16H18N2O4S/c1-16(2)12(15(21)22)18-13(20)11(14(18)23-16)17-10(19)8-9-6-4-3-5-7-9/h3-7,11-12,14H,8H2,1-2H3,(H,17,19)(H,21,22)/p-1/t11-,12+,14-/m1/s1
n/an/a 3.60E+3n/an/an/an/an/an/a
Kyushu University
Curated by ChEMBL
Assay Description
Inhibition of Enterobacter cloacae beta-lactamase incubated for 10 mins followed by nitrocefin substrate challenge and measured for 5 mins in presenc...
ACS Med Chem Lett 10: 923-928 (2019)
Article DOI: 10.1021/acsmedchemlett.9b00093
Beta-lactamase
(Enterobacter cloacae)
BDBM50377930
(Benzylpenicillin Sodium | PENICILLIN G SODIUM)
Show SMILES CC1(C)S[C@@H]2[C@H](NC(=O)Cc3ccccc3)C(=O)N2[C@H]1C([O-])=O |r|
Show InChI InChI=1S/C16H18N2O4S/c1-16(2)12(15(21)22)18-13(20)11(14(18)23-16)17-10(19)8-9-6-4-3-5-7-9/h3-7,11-12,14H,8H2,1-2H3,(H,17,19)(H,21,22)/p-1/t11-,12+,14-/m1/s1
n/an/a 7.20E+3n/an/an/an/an/an/a
Kyushu University
Curated by ChEMBL
Assay Description
Inhibition of Enterobacter cloacae beta-lactamase incubated for 10 mins followed by nitrocefin substrate challenge and measured for 5 mins by spectro...
ACS Med Chem Lett 10: 923-928 (2019)
Article DOI: 10.1021/acsmedchemlett.9b00093