BDBM50377933 CHEMBL1744354
SMILES: F[C@H]1C[C@@H](C#N)N(C1)C(=O)CNCCNc1ccc(cn1)C#N
InChI Key: InChIKey=KQTDWPQIVWQWQQ-STQMWFEESA-N
Data: 1 IC50
Activity Spreadsheet -- Enzyme Inhibition Constant Data from BindingDB
Found 1 hit for monomerid = 50377933
Trg + Lig
Ki
nM
ΔG°
kcal/mole
IC50
nM
Kd
nM
EC50/IC50
nM
koff
s-1
kon
M-1s-1
pHTemp
°C
Dipeptidyl peptidase 4
(Homo sapiens (Human))
BDBM50377933
(CHEMBL1744354)
Show SMILES F[C@H]1C[C@@H](C#N)N(C1)C(=O)CNCCNc1ccc(cn1)C#N |r|
Show InChI InChI=1S/C15H17FN6O/c16-12-5-13(7-18)22(10-12)15(23)9-19-3-4-20-14-2-1-11(6-17)8-21-14/h1-2,8,12-13,19H,3-5,9-10H2,(H,20,21)/t12-,13-/m0/s1
Reactome pathway
n/an/a 1.10n/an/an/an/an/an/a
Taisho Pharmaceutical Co., Ltd
Curated by ChEMBL
Assay Description
Inhibition of DPP4 in human plasma by fluorescence assay
Bioorg Med Chem 16: 4093-106 (2008)
Article DOI: 10.1016/j.bmc.2008.01.016
BindingDB Entry DOI: 10.7270/Q27H1KGN