BDBM50378010 CHEMBL1627312
SMILES: OC(CCNC(=O)c1cc2cc(I)ccc2[nH]1)CN1CCN(CC1)c1cccc(Cl)c1Cl
InChI Key: InChIKey=XIJZOWGASFOIBM-UHFFFAOYSA-N
Data: 3 KI  1 IC50
Activity Spreadsheet -- Enzyme Inhibition Constant Data from BindingDB
Found 4 hits for monomerid = 50378010
Trg + Lig
Ki
nM
ΔG°
kcal/mole
IC50
nM
Kd
nM
EC50/IC50
nM
koff
s-1
kon
M-1s-1
pHTemp
°C
D(3) dopamine receptor
(Homo sapiens (Human))
BDBM50378010
(CHEMBL1627312)
Show SMILES OC(CCNC(=O)c1cc2cc(I)ccc2[nH]1)CN1CCN(CC1)c1cccc(Cl)c1Cl
Show InChI InChI=1S/C23H25Cl2IN4O2/c24-18-2-1-3-21(22(18)25)30-10-8-29(9-11-30)14-17(31)6-7-27-23(32)20-13-15-12-16(26)4-5-19(15)28-20/h1-5,12-13,17,28,31H,6-11,14H2,(H,27,32)
5.21n/an/an/an/an/an/an/an/a
National Institute on Drug AbuseIntramural Research Program
Curated by ChEMBL
Assay Description
Displacement of [125]IABN from human D3 receptor expressed in HEK293 cells
J Med Chem 52: 2559-70 (2009)
Article DOI: 10.1021/jm900095y
BindingDB Entry DOI: 10.7270/Q2HX1DKJ
D(4) dopamine receptor
(Homo sapiens (Human))
BDBM50378010
(CHEMBL1627312)
Show SMILES OC(CCNC(=O)c1cc2cc(I)ccc2[nH]1)CN1CCN(CC1)c1cccc(Cl)c1Cl
Show InChI InChI=1S/C23H25Cl2IN4O2/c24-18-2-1-3-21(22(18)25)30-10-8-29(9-11-30)14-17(31)6-7-27-23(32)20-13-15-12-16(26)4-5-19(15)28-20/h1-5,12-13,17,28,31H,6-11,14H2,(H,27,32)
Reactome pathway
>1.00E+4n/an/an/an/an/an/an/an/a
National Institute on Drug AbuseIntramural Research Program
Curated by ChEMBL
Assay Description
Displacement of [125]IABN from human D4 receptor expressed in HEK293 cells
J Med Chem 52: 2559-70 (2009)
Article DOI: 10.1021/jm900095y
BindingDB Entry DOI: 10.7270/Q2HX1DKJ
D(1A) dopamine receptor
(Homo sapiens (Human))
BDBM50378010
(CHEMBL1627312)
Show SMILES OC(CCNC(=O)c1cc2cc(I)ccc2[nH]1)CN1CCN(CC1)c1cccc(Cl)c1Cl
Show InChI InChI=1S/C23H25Cl2IN4O2/c24-18-2-1-3-21(22(18)25)30-10-8-29(9-11-30)14-17(31)6-7-27-23(32)20-13-15-12-16(26)4-5-19(15)28-20/h1-5,12-13,17,28,31H,6-11,14H2,(H,27,32)
>1.00E+4n/an/an/an/an/an/an/an/a
National Institute on Drug AbuseIntramural Research Program
Curated by ChEMBL
Assay Description
Displacement of [3H]SCH23390 from D1 receptor
J Med Chem 52: 2559-70 (2009)
Article DOI: 10.1021/jm900095y
BindingDB Entry DOI: 10.7270/Q2HX1DKJ
D(3) dopamine receptor
(Homo sapiens (Human))
BDBM50378010
(CHEMBL1627312)
Show SMILES OC(CCNC(=O)c1cc2cc(I)ccc2[nH]1)CN1CCN(CC1)c1cccc(Cl)c1Cl
Show InChI InChI=1S/C23H25Cl2IN4O2/c24-18-2-1-3-21(22(18)25)30-10-8-29(9-11-30)14-17(31)6-7-27-23(32)20-13-15-12-16(26)4-5-19(15)28-20/h1-5,12-13,17,28,31H,6-11,14H2,(H,27,32)
n/an/a 38n/an/an/an/an/an/a
National Institute on Drug AbuseIntramural Research Program
Curated by ChEMBL
Assay Description
Antagonist activity at human D3 receptor expressed in HEK293 cells assessed as inhibition of quinpirole-stimulated mitogenesis
J Med Chem 52: 2559-70 (2009)
Article DOI: 10.1021/jm900095y
BindingDB Entry DOI: 10.7270/Q2HX1DKJ