BDBM50378260 CHEMBL577594
SMILES: CCOC(=O)C=CC(=O)N(CC(N)=O)NC(=O)[C@H](C)NC(=O)[C@@H](C)NC(=O)N1CCOCC1
InChI Key: InChIKey=QCLLJZFTGASVFY-OLZOCXBDSA-N
Data: 1 IC50
Activity Spreadsheet -- Enzyme Inhibition Constant Data from BindingDB
Found 1 hit for monomerid = 50378260
Trg + Lig
Ki
nM
ΔG°
kcal/mole
IC50
nM
Kd
nM
EC50/IC50
nM
koff
s-1
kon
M-1s-1
pHTemp
°C
Asparaginyl Endopeptidase (AE)
(Ixodes ricinus)
BDBM50378260
(CHEMBL577594)
Show SMILES CCOC(=O)C=CC(=O)N(CC(N)=O)NC(=O)[C@H](C)NC(=O)[C@@H](C)NC(=O)N1CCOCC1 |r,w:6.6|
Show InChI InChI=1S/C19H30N6O8/c1-4-33-16(28)6-5-15(27)25(11-14(20)26)23-18(30)13(3)21-17(29)12(2)22-19(31)24-7-9-32-10-8-24/h5-6,12-13H,4,7-11H2,1-3H3,(H2,20,26)(H,21,29)(H,22,31)(H,23,30)/t12-,13+/m1/s1
n/an/a 0.230n/an/an/an/an/an/a
Georgia Institute of Technology
Curated by ChEMBL
Assay Description
Inhibition of Ixodes ricinus asparaginyl endopeptidases
J Med Chem 52: 7192-210 (2009)
Article DOI: 10.1021/jm900849h
BindingDB Entry DOI: 10.7270/Q20C4WQ3