BDBM50378265 CHEMBL568037
SMILES: C[C@H](NC(=O)[C@@H](C)NC(=O)N1CCNCC1)C(=O)NN(CC(N)=O)C(=O)C=CC(=O)OCc1ccccc1
InChI Key: InChIKey=ICFJNHPHRAUATE-SJORKVTESA-N
Data: 1 IC50
Activity Spreadsheet -- Enzyme Inhibition Constant Data from BindingDB
Found 1 hit for monomerid = 50378265
Trg + Lig
Ki
nM
ΔG°
kcal/mole
IC50
nM
Kd
nM
EC50/IC50
nM
koff
s-1
kon
M-1s-1
pHTemp
°C
Asparaginyl Endopeptidase (AE)
(Ixodes ricinus)
BDBM50378265
(CHEMBL568037)
Show SMILES C[C@H](NC(=O)[C@@H](C)NC(=O)N1CCNCC1)C(=O)NN(CC(N)=O)C(=O)C=CC(=O)OCc1ccccc1 |r,w:26.26|
Show InChI InChI=1S/C24H33N7O7/c1-16(28-24(37)30-12-10-26-11-13-30)22(35)27-17(2)23(36)29-31(14-19(25)32)20(33)8-9-21(34)38-15-18-6-4-3-5-7-18/h3-9,16-17,26H,10-15H2,1-2H3,(H2,25,32)(H,27,35)(H,28,37)(H,29,36)/t16-,17+/m1/s1
n/an/a 13n/an/an/an/an/an/a
Georgia Institute of Technology
Curated by ChEMBL
Assay Description
Inhibition of Ixodes ricinus asparaginyl endopeptidases
J Med Chem 52: 7192-210 (2009)
Article DOI: 10.1021/jm900849h
BindingDB Entry DOI: 10.7270/Q20C4WQ3