BDBM50378269 CHEMBL574673
SMILES: CCOC(=O)C=CC(=O)N(CC(N)=O)NC(=O)[C@H](C)NC(=O)[C@@H](C)NC(=O)N1CCN(CC1)C(=O)OC(C)(C)C
InChI Key: InChIKey=JWPYYCZDPBGMRG-CVEARBPZSA-N
Data: 1 IC50
Activity Spreadsheet -- Enzyme Inhibition Constant Data from BindingDB
Found 1 hit for monomerid = 50378269
Trg + Lig
Ki
nM
ΔG°
kcal/mole
IC50
nM
Kd
nM
EC50/IC50
nM
koff
s-1
kon
M-1s-1
pHTemp
°C
Asparaginyl Endopeptidase (AE)
(Ixodes ricinus)
BDBM50378269
(CHEMBL574673)
Show SMILES CCOC(=O)C=CC(=O)N(CC(N)=O)NC(=O)[C@H](C)NC(=O)[C@@H](C)NC(=O)N1CCN(CC1)C(=O)OC(C)(C)C |r,w:6.6|
Show InChI InChI=1S/C24H39N7O9/c1-7-39-19(34)9-8-18(33)31(14-17(25)32)28-21(36)16(3)26-20(35)15(2)27-22(37)29-10-12-30(13-11-29)23(38)40-24(4,5)6/h8-9,15-16H,7,10-14H2,1-6H3,(H2,25,32)(H,26,35)(H,27,37)(H,28,36)/t15-,16+/m1/s1
n/an/a 8.5n/an/an/an/an/an/a
Georgia Institute of Technology
Curated by ChEMBL
Assay Description
Inhibition of Ixodes ricinus asparaginyl endopeptidases
J Med Chem 52: 7192-210 (2009)
Article DOI: 10.1021/jm900849h
BindingDB Entry DOI: 10.7270/Q20C4WQ3