BDBM50378430 CHEMBL568019
SMILES: CCNC(=O)Nc1cn2c(cc(cc2n1)-c1cccnc1)-c1ncc(Cl)cn1
InChI Key: InChIKey=LXKRVXJCHWCIQA-UHFFFAOYSA-N
Data: 2 IC50
Activity Spreadsheet -- Enzyme Inhibition Constant Data from BindingDB
Found 2 hits for monomerid = 50378430
Trg + Lig
Ki
nM
ΔG°
kcal/mole
IC50
nM
Kd
nM
EC50/IC50
nM
koff
s-1
kon
M-1s-1
pHTemp
°C
ParE
(Streptococcus pneumoniae)
BDBM50378430
(CHEMBL568019)
Show SMILES CCNC(=O)Nc1cn2c(cc(cc2n1)-c1cccnc1)-c1ncc(Cl)cn1
Show InChI InChI=1S/C19H16ClN7O/c1-2-22-19(28)26-16-11-27-15(18-23-9-14(20)10-24-18)6-13(7-17(27)25-16)12-4-3-5-21-8-12/h3-11H,2H2,1H3,(H2,22,26,28)
n/an/a 419n/an/an/an/an/an/a
Pfizer Inc.
Curated by ChEMBL
Assay Description
Inhibition of Streptococcus pneumoniae SP-3 parE after 30 mins
Bioorg Med Chem Lett 19: 5302-6 (2009)
Article DOI: 10.1016/j.bmcl.2009.07.141
BindingDB Entry DOI: 10.7270/Q23X87KD
DNA gyrase subunit B
(Streptococcus pneumoniae)
BDBM50378430
(CHEMBL568019)
Show SMILES CCNC(=O)Nc1cn2c(cc(cc2n1)-c1cccnc1)-c1ncc(Cl)cn1
Show InChI InChI=1S/C19H16ClN7O/c1-2-22-19(28)26-16-11-27-15(18-23-9-14(20)10-24-18)6-13(7-17(27)25-16)12-4-3-5-21-8-12/h3-11H,2H2,1H3,(H2,22,26,28)
n/an/a 149n/an/an/an/an/an/a
Pfizer Inc.
Curated by ChEMBL
Assay Description
Inhibition of Streptococcus pneumoniae SP-3 gyrB by enzyme coupled phosphate assay
Bioorg Med Chem Lett 19: 5302-6 (2009)
Article DOI: 10.1016/j.bmcl.2009.07.141
BindingDB Entry DOI: 10.7270/Q23X87KD