BDBM50378451 CHEMBL578362
SMILES: CCNC(=O)Nc1cn2c(cc(cc2n1)-c1cncnc1)-c1ncc(C)cn1
InChI Key: InChIKey=FVGMXEKHKSNPMB-UHFFFAOYSA-N
Data: 2 IC50
Activity Spreadsheet -- Enzyme Inhibition Constant Data from BindingDB
Found 2 hits for monomerid = 50378451
Trg + Lig
Ki
nM
ΔG°
kcal/mole
IC50
nM
Kd
nM
EC50/IC50
nM
koff
s-1
kon
M-1s-1
pHTemp
°C
ParE
(Streptococcus pneumoniae)
BDBM50378451
(CHEMBL578362)
Show SMILES CCNC(=O)Nc1cn2c(cc(cc2n1)-c1cncnc1)-c1ncc(C)cn1
Show InChI InChI=1S/C19H18N8O/c1-3-22-19(28)26-16-10-27-15(18-23-6-12(2)7-24-18)4-13(5-17(27)25-16)14-8-20-11-21-9-14/h4-11H,3H2,1-2H3,(H2,22,26,28)
n/an/a 258n/an/an/an/an/an/a
Pfizer Inc.
Curated by ChEMBL
Assay Description
Inhibition of Streptococcus pneumoniae SP-3 parE after 30 mins
Bioorg Med Chem Lett 19: 5302-6 (2009)
Article DOI: 10.1016/j.bmcl.2009.07.141
BindingDB Entry DOI: 10.7270/Q23X87KD
DNA gyrase subunit B
(Streptococcus pneumoniae)
BDBM50378451
(CHEMBL578362)
Show SMILES CCNC(=O)Nc1cn2c(cc(cc2n1)-c1cncnc1)-c1ncc(C)cn1
Show InChI InChI=1S/C19H18N8O/c1-3-22-19(28)26-16-10-27-15(18-23-6-12(2)7-24-18)4-13(5-17(27)25-16)14-8-20-11-21-9-14/h4-11H,3H2,1-2H3,(H2,22,26,28)
n/an/a 36n/an/an/an/an/an/a
Pfizer Inc.
Curated by ChEMBL
Assay Description
Inhibition of Streptococcus pneumoniae SP-3 gyrB by enzyme coupled phosphate assay
Bioorg Med Chem Lett 19: 5302-6 (2009)
Article DOI: 10.1016/j.bmcl.2009.07.141
BindingDB Entry DOI: 10.7270/Q23X87KD