BDBM50378602 CHEMBL600188
SMILES: CC(=O)N[C@@H]1[C@@H](O)C[C@](OCc2cccc(Cl)c2Cl)(O[C@H]1[C@H](O)[C@@H](O)CNC(=O)c1ccc(Cl)cc1)C([O-])=O
InChI Key: InChIKey=OJUKXYCTUMEOEF-JICKDSIQSA-M
Data: 1 Kd
Activity Spreadsheet -- Enzyme Inhibition Constant Data from BindingDB
Found 1 hit for monomerid = 50378602
Trg + Lig
Ki
nM
ΔG°
kcal/mole
IC50
nM
Kd
nM
EC50/IC50
nM
koff
s-1
kon
M-1s-1
pHTemp
°C
Myelin-associated glycoprotein
(Mus musculus)
BDBM50378602
(CHEMBL600188)
Show SMILES CC(=O)N[C@@H]1[C@@H](O)C[C@](OCc2cccc(Cl)c2Cl)(O[C@H]1[C@H](O)[C@@H](O)CNC(=O)c1ccc(Cl)cc1)C([O-])=O |r|
Show InChI InChI=1S/C25H27Cl3N2O9/c1-12(31)30-20-17(32)9-25(24(36)37,38-11-14-3-2-4-16(27)19(14)28)39-22(20)21(34)18(33)10-29-23(35)13-5-7-15(26)8-6-13/h2-8,17-18,20-22,32-34H,9-11H2,1H3,(H,29,35)(H,30,31)(H,36,37)/p-1/t17-,18-,20+,21+,22+,25-/m0/s1
Reactome pathway
n/an/an/a 4.30E+3n/an/an/an/an/a
University of Basel
Curated by ChEMBL
Assay Description
Binding affinity to mouse MAGd1-3Fc expressed in CHO-Lec 3.2.8.1 cells by SPR analysis
J Med Chem 53: 1597-615 (2010)
Article DOI: 10.1021/jm901517k
BindingDB Entry DOI: 10.7270/Q2V69KHM