BDBM50378746 CHEMBL1204065
SMILES: C[C@H]1CN(C[C@@H](C)[C@]1(O)c1ccccc1)C(=O)[C@@H]1CN(C)C[C@H]1c1ccc(F)cc1F
InChI Key: InChIKey=YBBALUHIMYLJPN-LCMUWFFXSA-N
Data: 1 KI  4 EC50
Activity Spreadsheet -- Enzyme Inhibition Constant Data from BindingDB
Found 5 hits for monomerid = 50378746
Trg + Lig
Ki
nM
ΔG°
kcal/mole
IC50
nM
Kd
nM
EC50/IC50
nM
koff
s-1
kon
M-1s-1
pHTemp
°C
Melanocortin receptor 4
(Homo sapiens (Human))
BDBM50378746
(CHEMBL1204065)
Show SMILES C[C@H]1CN(C[C@@H](C)[C@]1(O)c1ccccc1)C(=O)[C@@H]1CN(C)C[C@H]1c1ccc(F)cc1F |r|
Show InChI InChI=1S/C25H30F2N2O2/c1-16-12-29(13-17(2)25(16,31)18-7-5-4-6-8-18)24(30)22-15-28(3)14-21(22)20-10-9-19(26)11-23(20)27/h4-11,16-17,21-22,31H,12-15H2,1-3H3/t16-,17+,21-,22+,25-/m0/s1
107n/an/an/an/an/an/an/an/a
Pfizer Global Research and Development
Curated by ChEMBL
Assay Description
Displacement of [3H] melanocortin-2 from human recombinant MC4 receptor expressed in CHO cells by scintillation counting
J Med Chem 53: 3183-97 (2010)
Article DOI: 10.1021/jm9017866
BindingDB Entry DOI: 10.7270/Q20G3M4T
Melanocortin receptor 4
(Homo sapiens (Human))
BDBM50378746
(CHEMBL1204065)
Show SMILES C[C@H]1CN(C[C@@H](C)[C@]1(O)c1ccccc1)C(=O)[C@@H]1CN(C)C[C@H]1c1ccc(F)cc1F |r|
Show InChI InChI=1S/C25H30F2N2O2/c1-16-12-29(13-17(2)25(16,31)18-7-5-4-6-8-18)24(30)22-15-28(3)14-21(22)20-10-9-19(26)11-23(20)27/h4-11,16-17,21-22,31H,12-15H2,1-3H3/t16-,17+,21-,22+,25-/m0/s1
n/an/an/an/a 717n/an/an/an/a
Pfizer Global Research and Development
Curated by ChEMBL
Assay Description
Agonist activity at human recombinant MC4 receptor expressed in CHO cells by cAMP responsive beta lactamase reporter gene assay
J Med Chem 53: 3183-97 (2010)
Article DOI: 10.1021/jm9017866
BindingDB Entry DOI: 10.7270/Q20G3M4T
Melanocyte-stimulating hormone receptor
(Homo sapiens (Human))
BDBM50378746
(CHEMBL1204065)
Show SMILES C[C@H]1CN(C[C@@H](C)[C@]1(O)c1ccccc1)C(=O)[C@@H]1CN(C)C[C@H]1c1ccc(F)cc1F |r|
Show InChI InChI=1S/C25H30F2N2O2/c1-16-12-29(13-17(2)25(16,31)18-7-5-4-6-8-18)24(30)22-15-28(3)14-21(22)20-10-9-19(26)11-23(20)27/h4-11,16-17,21-22,31H,12-15H2,1-3H3/t16-,17+,21-,22+,25-/m0/s1
n/an/an/an/a>7.81E+3n/an/an/an/a
Pfizer Global Research and Development
Curated by ChEMBL
Assay Description
Agonist activity at human recombinant MC1 receptor expressed in HEK293 cells assessed as cAMP accumulation by enzyme fragment complementation assay
J Med Chem 53: 3183-97 (2010)
Article DOI: 10.1021/jm9017866
BindingDB Entry DOI: 10.7270/Q20G3M4T
Melanocortin receptor 3
(Homo sapiens (Human))
BDBM50378746
(CHEMBL1204065)
Show SMILES C[C@H]1CN(C[C@@H](C)[C@]1(O)c1ccccc1)C(=O)[C@@H]1CN(C)C[C@H]1c1ccc(F)cc1F |r|
Show InChI InChI=1S/C25H30F2N2O2/c1-16-12-29(13-17(2)25(16,31)18-7-5-4-6-8-18)24(30)22-15-28(3)14-21(22)20-10-9-19(26)11-23(20)27/h4-11,16-17,21-22,31H,12-15H2,1-3H3/t16-,17+,21-,22+,25-/m0/s1
n/an/an/an/a>1.91E+4n/an/an/an/a
Pfizer Global Research and Development
Curated by ChEMBL
Assay Description
Agonist activity at human recombinant MC3 receptor expressed in CHO cells assessed as cAMP accumulation by enzyme fragment complementation assay
J Med Chem 53: 3183-97 (2010)
Article DOI: 10.1021/jm9017866
BindingDB Entry DOI: 10.7270/Q20G3M4T
Melanocortin receptor 5 (MC5R)
(Homo sapiens (Human))
BDBM50378746
(CHEMBL1204065)
Show SMILES C[C@H]1CN(C[C@@H](C)[C@]1(O)c1ccccc1)C(=O)[C@@H]1CN(C)C[C@H]1c1ccc(F)cc1F |r|
Show InChI InChI=1S/C25H30F2N2O2/c1-16-12-29(13-17(2)25(16,31)18-7-5-4-6-8-18)24(30)22-15-28(3)14-21(22)20-10-9-19(26)11-23(20)27/h4-11,16-17,21-22,31H,12-15H2,1-3H3/t16-,17+,21-,22+,25-/m0/s1
n/an/an/an/a 2.00E+4n/an/an/an/a
Pfizer Global Research and Development
Curated by ChEMBL
Assay Description
Agonist activity at human recombinant MC5 receptor expressed in HEK293 cells assessed as cAMP accumulation by beta lactamase reporter gene assay
J Med Chem 53: 3183-97 (2010)
Article DOI: 10.1021/jm9017866
BindingDB Entry DOI: 10.7270/Q20G3M4T