BDBM50378910 TOPOPYRONE C
SMILES: Cc1cc(=O)c2c(O)cc3C(=O)c4cc(O)cc(O)c4C(=O)c3c2o1
InChI Key: InChIKey=AWDAPFGGFWZKGB-UHFFFAOYSA-N
Data: 1 Kd
Activity Spreadsheet -- Enzyme Inhibition Constant Data from BindingDB
Found 1 hit for monomerid = 50378910
Trg + Lig
Ki
nM
ΔG°
kcal/mole
IC50
nM
Kd
nM
EC50/IC50
nM
koff
s-1
kon
M-1s-1
pHTemp
°C
Serine/threonine-protein kinase WEE1
(Homo sapiens (Human))
BDBM50378910
(TOPOPYRONE C)
Show SMILES Cc1cc(=O)c2c(O)cc3C(=O)c4cc(O)cc(O)c4C(=O)c3c2o1
Show InChI InChI=1S/C18H10O7/c1-6-2-10(20)15-12(22)5-9-14(18(15)25-6)17(24)13-8(16(9)23)3-7(19)4-11(13)21/h2-5,19,21-22H,1H3
NCI pathway
Reactome pathway
n/an/an/a 1.35n/an/an/an/an/a
Universita di Salerno
Curated by ChEMBL
Assay Description
Binding affinity to weel kinase
J Nat Prod 74: 1401-7 (2011)
Article DOI: 10.1021/np100935s
BindingDB Entry DOI: 10.7270/Q20V8DSJ