BDBM50378977 CHEMBL1621896
SMILES: COc1ccc(Br)cc1CN1CCCC(C1)C(=O)N1CCCCC1
InChI Key: InChIKey=POCCWDXEMQOTQF-UHFFFAOYSA-N
Data: 1 Kd
Activity Spreadsheet -- Enzyme Inhibition Constant Data from BindingDB
Found 1 hit for monomerid = 50378977
Trg + Lig
Ki
nM
ΔG°
kcal/mole
IC50
nM
Kd
nM
EC50/IC50
nM
koff
s-1
kon
M-1s-1
pHTemp
°C
C-C chemokine receptor type 5
(Homo sapiens (Human))
BDBM50378977
(CHEMBL1621896)
Show SMILES COc1ccc(Br)cc1CN1CCCC(C1)C(=O)N1CCCCC1
Show InChI InChI=1S/C19H27BrN2O2/c1-24-18-8-7-17(20)12-16(18)14-21-9-5-6-15(13-21)19(23)22-10-3-2-4-11-22/h7-8,12,15H,2-6,9-11,13-14H2,1H3
n/an/an/a 4.90E+4n/an/an/an/an/a
TBA
Curated by ChEMBL
Assay Description
Binding affinity to C-terminus C9-tagged immobilized CCR5 by SPR analysis
ACS Med Chem Lett 2: 549-554 (2011)
Article DOI: 10.1021/ml2000017
BindingDB Entry DOI: 10.7270/Q2X0682G