BDBM50378980 CHEMBL1618631
SMILES: CC(C)NCc1cc(Br)ccc1OCc1ccccc1
InChI Key: InChIKey=IIIVMSZGSFSEHF-UHFFFAOYSA-N
Data: 1 Kd
Activity Spreadsheet -- Enzyme Inhibition Constant Data from BindingDB
Found 1 hit for monomerid = 50378980
Trg + Lig
Ki
nM
ΔG°
kcal/mole
IC50
nM
Kd
nM
EC50/IC50
nM
koff
s-1
kon
M-1s-1
pHTemp
°C
C-C chemokine receptor type 5
(Homo sapiens (Human))
BDBM50378980
(CHEMBL1618631)
Show SMILES CC(C)NCc1cc(Br)ccc1OCc1ccccc1
Show InChI InChI=1S/C17H20BrNO/c1-13(2)19-11-15-10-16(18)8-9-17(15)20-12-14-6-4-3-5-7-14/h3-10,13,19H,11-12H2,1-2H3
n/an/an/a 1.00E+4n/an/an/an/an/a
TBA
Curated by ChEMBL
Assay Description
Binding affinity to C-terminus C9-tagged immobilized CCR5 by SPR analysis
ACS Med Chem Lett 2: 549-554 (2011)
Article DOI: 10.1021/ml2000017
BindingDB Entry DOI: 10.7270/Q2X0682G