BDBM50378983 CHEMBL1907216
SMILES: Brc1ccc(OCc2ccccc2)c(CNCC2CCCO2)c1
InChI Key: InChIKey=PREAXUKGCQUJBJ-UHFFFAOYSA-N
Data: 1 Kd
Activity Spreadsheet -- Enzyme Inhibition Constant Data from BindingDB
Found 1 hit for monomerid = 50378983
Trg + Lig
Ki
nM
ΔG°
kcal/mole
IC50
nM
Kd
nM
EC50/IC50
nM
koff
s-1
kon
M-1s-1
pHTemp
°C
C-C chemokine receptor type 5
(Homo sapiens (Human))
BDBM50378983
(CHEMBL1907216)
Show SMILES Brc1ccc(OCc2ccccc2)c(CNCC2CCCO2)c1
Show InChI InChI=1S/C19H22BrNO2/c20-17-8-9-19(23-14-15-5-2-1-3-6-15)16(11-17)12-21-13-18-7-4-10-22-18/h1-3,5-6,8-9,11,18,21H,4,7,10,12-14H2
n/an/an/a 1.84E+4n/an/an/an/an/a
TBA
Curated by ChEMBL
Assay Description
Binding affinity to C-terminus C9-tagged immobilized CCR5 by SPR analysis
ACS Med Chem Lett 2: 549-554 (2011)
Article DOI: 10.1021/ml2000017
BindingDB Entry DOI: 10.7270/Q2X0682G